program: Gaussian 09
title: 000075696
version: EM64L-G09RevD.01
frameworkgroup: C1[X(C10H4N2O4)]
method: RPBEPBE
basis: SDD
operation: Freq
keyword: #p
keyword: freq=noraman
keyword: PBEPBE/SDD
title: #p freq=noraman PBEPBE/SDD
converged: NO NO NO NO
title: Mulliken charges:
elementType: O O O O N N C C C C C C C C C C H H H H
charge: -0.182338 -0.182359 -0.182340 -0.182354 -0.419266 -0.419265 0.199895 0.199915 0.199897 0.199903 -0.498010 -0.498009 0.108757 0.108750 0.108753 0.108757 0.303430 0.303433 0.361225 0.361226
chargesum: 0.00000
title: Mulliken charges with hydrogens summed into heavy atoms:
elementType: O O O O N N C C C C C C C C C C
charge: -0.182338 -0.182359 -0.182340 -0.182354 -0.058041 -0.058039 0.199895 0.199915 0.199897 0.199903 -0.194580 -0.194576 0.108757 0.108750 0.108753 0.108757
polarizability: 1.87842593e+02 -7.08963349e-04 1.66654045e+02 -2.33830695e-04 5.13826749e-03 4.94340279e+01
1716.lowfreq: -4.3619 -0.0011 -0.0008 -0.0006 6.3944 7.3634 69.7958 96.6941 154.5296
frequency: 69.7958 96.6941 154.5296 170.5505 175.2817 199.7810 241.4003 254.5839 274.4333 352.3551 416.7869 481.1213 494.3834 545.8170 548.2124 609.9535 624.0955 627.9762 659.5451 661.4424 666.7415 677.3816 727.0353 741.3902 751.8465 754.2781 795.4336 796.5981 928.2769 955.8317 956.5373 1038.4810 1084.9261 1111.1316 1137.4927 1166.1554 1221.0225 1257.2535 1310.0943 1314.3393 1315.2092 1410.7087 1460.8365 1465.2213 1604.6513 1626.5186 1660.9662 1664.4602 1680.3418 1690.3603 3168.7259 3170.2902 3569.6259 3570.0781
redmass: 15.3950 7.9154 12.8913 11.3394 9.2167 5.5656 10.4381 14.7662 7.2998 12.1934 2.9903 10.2945 12.2525 9.5524 6.5185 13.0981 12.0895 7.9950 4.3775 1.2749 1.1771 4.3762 3.8295 7.0191 5.0937 8.3029 4.5498 12.1045 4.3656 1.5127 1.4536 4.3968 1.6944 7.5808 9.0039 9.6302 1.2670 7.2808 10.9686 1.6044 1.6155 4.0900 10.2947 5.7118 10.4391 7.9918 7.9977 7.9278 12.9192 12.9078 1.0947 1.0946 1.0801 1.0803
irintensity: 0.0000 0.7931 1.7444 0.0000 15.5127 0.0000 0.0000 0.0000 0.0000 42.3954 8.5316 0.0000 0.0000 5.9561 0.0000 7.7166 0.0000 0.0000 0.0015 126.9164 0.0005 21.6793 198.6054 0.0000 17.0563 0.0000 0.0000 0.0000 0.0000 23.0724 0.0001 158.2665 2.6406 0.0000 36.8678 0.0000 0.0000 537.2566 0.0000 0.0006 13.2433 1.8246 2.7411 5.8184 0.0000 0.0000 0.0033 1029.4182 188.7123 0.0014 3.3040 0.0000 215.8786 0.3236
temp: 298.150 k
press: 1.00000 atm
elementType: 8 8 8 8 7 7 6 6 6 6 6 6 6 6 6 6 1 1 1 1
symmnumber: 1
zpe: 335606.2 jmol-1
zpe.correction: 0.127826 hartree
zpe.thermalcorrener: 0.139385 hartree
zpe.thermalcorrenthalpy: 0.140329 hartree
zpe.thermalcorrgfe: 0.089832 hartree
zpe.sumelectzpe: -792.844897 hartree
zpe.sumelectthermal: -792.833337 hartree
zpe.sumelectthermalent: -792.832393 hartree
zpe.sumelectthermalfe: -792.882890 hartree
dipole: 0.0001 -0.0003 -0.0002
dipole: 0.0003
quadrupole: -86.9278 -114.3924 -88.1858
quadrupole: 0.0006 -0.0004 -0.0011
quadrupole: 9.5742 -17.8904 8.3162 0.0006 -0.0004 -0.0011
hfenergy: -792.9727225 hartree
pointgroup: C01 [X(C10H4N2O4)]
dipole: 0.0000214 -0.0001172 -0.0000595 debye
dipolederiv: -0.6681279 -0.2703718 0.0000176 -0.2575409 -0.9764058 0.0000438 0.0000163 0.0000107 -0.3221975 -0.6681452 0.2703619 -0.0000301 0.2575189 -0.9763108 0.0001036 0.0000187 -0.000065 -0.3222068 -0.6681658 0.2703971 0.0000515 0.2575601 -0.9763598 -0.0001464 0.0000074 -0.0000139 -0.3221985 -0.6681149 -0.2703434 -0.00002 -0.2575061 -0.9763677 -0.0000428 -0.0000413 -0.0000923 -0.322206 -0.8779578 0.0000113 0.0000078 0.0000088 -1.2434247 0.0000216 0.000048 0.000057 -0.3504292 -0.8779613 0.0000276 -0.0000392 0.000038 -1.2434277 -0.0000988 -0.0001327 -0.0001004 -0.3504271 -0.2988671 -0.121148 -0.0000018 -0.2331463 -0.0886841 -0.0000103 -0.0000302 0.000002 0.0011617 -0.298855 0.1211101 0.0000227 0.2331174 -0.0886385 -0.0000051 -0.0000032 -0.0000261 0.0011731 -0.2988619 0.1211275 -0.000005 0.2331245 -0.088656 -0.0000089 0.0000387 0.000019 0.0011678 -0.2988473 -0.1211321 -0.0000197 -0.2331515 -0.088672 0.0000038 0.0000226 -0.000024 0.0011658 -0.1852047 0.0000007 -0.0000078 -0.0000001 0.133703 0.0000165 0.0000315 0.0000054 -0.0503649 -0.185204 -0.0000029 0.000008 -0.000002 0.1337021 0.0000092 -0.0000301 0.0000335 -0.0503613 1.3012083 -0.0217976 -0.0000168 0.1539327 1.513515 -0.0000406 -0.0000683 0.0000049 0.2584775 1.3011578 0.0218314 -0.0000164 -0.1538969 1.5134058 -0.0001575 0.0000251 -0.000023 0.2584601 1.3012007 0.0217722 0.0000226 -0.1539584 1.5134954 0.0002719 -0.0000068 0.0001486 0.2584713 1.3011811 -0.021844 0.0000209 0.1538828 1.5134437 0.0000586 0.00007 0.0000864 0.2584687 0.1148024 -0.0000041 0.0000009 0.0000008 0.057729 -0.0000062 0.0000183 0. 0.1595833 0.114804 -0.0000037 -0.0000004 0.0000021 0.0577358 -0.0000053 -0.0000186 -0.0000093 0.1595832 0.2799802 0.0000036 0.0000061 0.0000104 0.155108 0.0000205 -0.0000028 0.0000119 0.3663395 0.2799785 0.0000045 -0.0000007 0.0000059 0.1551094 -0.0000278 0.0000375 -0.0000253 0.3663393 unknown
polarizability: 187.8425927|-0.0001293|166.6540448|-0.000234|0.0051383|49.4340279 unknown
InChI: InChI=1S/C10H4N2O4/c13-7-3-1-4-6(10(16)12-8(4)14)2-5(3)9(15)11-7/h1-2,11-12H
charge 0 multiplicity 1
20 atoms
O  -3.055816 -2.359447 0.000067
O  -3.055961 2.359258 -0.000016
O  3.055973 -2.35925 -0.000237
O  3.055748 2.359446 0.000251
N  -3.396716 -0.000101 0.000073
N  3.396687 0.000114 0.000113
C  -1.187811 -0.710989 -0.000068
C  -1.187861 0.710911 -0.000032
C  1.187827 -0.710934 -0.00011
C  1.187779 0.710959 -0.000011
C  0.000023 -1.465606 -0.00014
C  -0.000059 1.46558 0.00001
C  -2.616746 -1.187186 0.000067
C  -2.616821 1.187001 -0.000141
C  2.616812 -1.18702 -0.000208
C  2.616701 1.187163 0.000094
H  0.000034 -2.55976 -0.000203
H  -0.000067 2.559734 0.000076
H  -4.41862 -0.000121 0.000168
H  4.418594 0.000148 0.000152
