program: Gaussian 16
title: Title Card Required
version: ES64L-G16RevC.01
method: RB3LYP
basis: 6-31+G(d,p)
operation: Freq
keyword: #N
keyword: Geom=AllCheck
keyword: Guess=TCheck
keyword: SCRF=Check
keyword: GenChk
keyword: RB3LYP/6-31+G(d,p)
keyword: Freq
converged: YES YES NO YES
title: Mulliken charges:
elementType: C C C C C C H H H H H H H C H H H C H H H C H C C H H C H H C H H C H H H C C H H C H H C H H H C H C H H
charge: -0.388342 0.028018 -0.469837 -0.308875 0.081327 -0.118498 0.126840 0.143984 0.146740 0.151512 0.132688 0.140546 0.150187 -0.497203 0.163053 0.138334 0.139154 -0.357677 0.144669 0.164999 0.147488 -0.206799 0.137876 0.454998 0.180034 0.186051 0.148804 -0.473568 0.183714 0.173581 0.064757 0.160943 0.153842 -0.427529 0.148150 0.154085 0.153917 0.284773 -0.541933 0.199829 0.191248 -0.717724 0.198453 0.171214 -0.455967 0.174950 0.205414 0.183103 0.011900 0.182652 -0.510684 0.185680 0.185129
chargesum: 1.00000
title: Mulliken charges with hydrogens summed into heavy atoms:
elementType: C C C C C C C C C C C C C C C C C C C C
charge: -0.090090 0.298842 -0.469837 -0.176188 0.081327 0.172236 -0.056662 0.099478 -0.068923 0.454998 0.328838 -0.116274 0.379542 0.028624 0.284773 -0.150857 -0.348057 0.107500 0.194552 0.046176
1716.lowfreq: -7.2150 -5.3139 -3.6420 -0.0006 -0.0004 0.0004 29.5389 62.6379 90.0354
frequency: 29.5173 62.6367 90.0341 108.3459 140.4562 142.8260 153.2007 180.2476 187.8475 202.4939 218.0897 234.1582 236.6815 242.4535 264.1894 284.7962 288.5516 294.2291 308.5650 309.5617 320.4054 328.1498 342.3990 351.1767 381.4803 400.4402 415.2340 431.1341 445.2760 462.7713 483.1602 493.8447 528.4446 550.9745 568.7154 633.7853 639.0341 675.9067 702.6946 744.3386 784.3134 795.3179 829.5147 835.9010 854.8321 869.4691 888.9581 903.9228 914.5559 937.6948 942.9754 951.5143 953.6013 969.5865 983.2544 988.7709 994.3981 1005.2861 1015.6171 1027.9777 1031.4760 1052.6956 1061.9358 1067.0314 1074.4572 1079.5132 1084.0102 1095.2523 1108.4228 1121.7642 1125.0591 1144.3532 1172.9103 1191.0691 1199.0569 1202.2849 1222.6120 1225.3031 1241.2105 1247.8174 1248.7600 1264.5858 1284.0693 1322.2243 1334.3157 1350.1801 1352.8236 1367.7776 1373.4579 1374.7399 1384.8304 1386.5163 1390.8908 1402.5377 1408.7147 1413.1670 1417.2222 1419.7897 1427.4175 1429.6592 1440.4387 1451.2595 1465.8902 1475.4471 1482.2035 1484.8264 1489.0471 1490.3104 1493.6736 1497.0916 1502.1666 1504.5549 1507.0056 1511.1390 1512.7412 1515.2210 1524.0538 1528.2056 1608.9257 1651.0477 3001.6114 3006.7574 3007.9073 3015.5144 3020.3369 3023.4684 3032.5991 3035.9825 3041.9883 3055.3764 3055.9641 3059.1074 3066.4723 3074.2815 3076.7247 3084.8233 3094.3180 3098.8546 3103.4889 3104.1420 3105.2735 3109.3075 3114.5084 3119.4122 3141.4904 3146.0324 3146.1108 3149.7103 3150.3001 3151.2599 3170.7871 3179.5160 3234.3311
redmass: 3.1746 3.1340 2.8782 2.4104 2.4875 1.2316 1.1503 2.7671 2.7344 2.6832 1.3415 1.8893 2.3262 1.4517 1.2191 2.4735 2.1681 2.3038 2.6819 2.5921 2.2803 2.2879 2.3017 2.7317 2.5447 2.3810 2.5172 2.5405 2.6075 3.1081 2.4483 2.5699 2.9262 2.0871 3.0249 3.3451 2.8035 3.2588 3.1091 2.6944 2.1020 1.8357 2.0405 1.5044 1.6101 1.5431 2.2533 1.2943 1.8447 1.7516 1.9392 1.6140 1.6769 1.7704 1.6796 1.9344 1.6568 1.6866 1.6277 1.9800 1.6050 1.6819 1.6173 1.7625 1.8078 1.7093 1.5876 2.1065 2.0296 1.5064 1.9109 1.6728 1.6324 1.7047 1.7670 2.1302 1.8608 1.5650 1.5580 1.8008 1.4727 2.3116 1.9382 1.3637 1.3147 1.4590 1.4286 1.3723 1.4275 1.3136 1.3807 1.5243 1.4696 1.3881 1.5659 1.2477 1.4217 1.2707 1.3361 1.2617 1.2231 1.1022 1.0941 1.0838 1.0742 1.0805 1.0463 1.0767 1.0698 1.0857 1.2475 1.0650 1.0803 1.0728 1.0600 1.0844 1.0607 1.0606 4.2245 5.8941 1.0556 1.0808 1.0821 1.0668 1.0682 1.0684 1.0611 1.0384 1.0396 1.0491 1.0520 1.0500 1.0901 1.0987 1.0923 1.0876 1.0898 1.0832 1.0964 1.0769 1.1001 1.1014 1.1005 1.0963 1.1013 1.0784 1.0901 1.0984 1.0990 1.0873 1.0907 1.0932 1.1136
irintensity: 0.6703 0.2799 3.3059 0.3515 9.0618 2.7517 0.6182 0.7901 18.0245 3.4064 4.1531 19.0595 1.2431 0.7685 0.6671 9.7673 17.2348 24.6026 11.9511 60.5459 10.6703 0.1543 4.1979 0.0316 6.1271 4.1503 1.9182 2.8256 0.7851 0.9257 1.5627 10.2163 0.5616 0.7187 1.3828 16.4398 10.0152 3.5010 5.5275 4.4468 1.3926 6.1336 2.1758 2.9860 7.3360 1.8657 0.8190 6.9715 13.3786 0.7000 3.0708 0.4701 2.8981 2.9009 6.4836 1.1329 4.4548 8.8331 10.6026 3.5943 3.3321 2.8077 12.4075 17.2843 2.9219 6.6504 28.9225 10.4891 1.7308 31.4234 1.5609 8.2438 7.7338 9.0838 0.8560 4.3383 1.0118 1.8246 3.4816 1.2343 4.7760 38.5862 6.2616 10.3620 11.0291 1.5702 0.7571 2.9710 1.3332 0.4453 4.2096 3.9968 1.9757 11.9531 1.3273 6.9882 27.1190 8.1190 19.8079 10.2933 21.9141 40.1333 10.4175 2.3967 19.4551 1.6637 1.0116 1.7233 7.0641 23.9672 12.4338 2.2866 4.5392 16.1051 13.1456 1.2040 14.3484 3.9304 187.0816 120.3004 7.0366 10.7311 12.0598 24.2929 4.3405 9.4914 30.5335 28.3392 0.5239 12.8338 23.8187 18.1071 6.8629 17.1335 43.7041 2.9716 14.4968 35.0050 6.9907 3.3390 40.3311 0.9863 59.9847 26.4012 10.7409 6.3954 7.4977 20.6217 2.6201 13.3963 5.5011 21.7838 1.1463
temp: 298.150 k
press: 1.00000 atm
elementType: 6 6 6 6 6 6 1 1 1 1 1 1 1 6 1 1 1 6 1 1 1 6 1 6 6 1 1 6 1 1 6 1 1 6 1 1 1 6 6 1 1 6 1 1 6 1 1 1 6 1 6 1 1
symmnumber: 1
zpe: 1283237.9 jmol-1
zpe.correction: 0.488760 hartree
zpe.thermalcorrener: 0.509704 hartree
zpe.thermalcorrenthalpy: 0.510648 hartree
zpe.thermalcorrgfe: 0.442209 hartree
zpe.sumelectzpe: -781.411453 hartree
zpe.sumelectthermal: -781.390509 hartree
zpe.sumelectthermalent: -781.389565 hartree
zpe.sumelectthermalfe: -781.458004 hartree
dipole: -9.2472 1.2983 0.3457
dipole: 9.3443
quadrupole: -71.1333 -111.0414 -118.1353
quadrupole: -0.9878 -0.5521 2.0703
quadrupole: 28.9700 -10.9381 -18.0320 -0.9878 -0.5521 2.0703
hfenergy: -781.9002128 hartree
pointgroup: C01 [X(C20H33)]
dipole: -3.6363899 0.5191585 0.1505772 debye
polarizability: 282.1940713|13.6160592|210.6464655|9.0491255|4.9008645|188.7383424 unknown
InChI: InChI=1/C20H33/c1-7-15(2)9-11-17-16(3)10-12-18-19(4,5)13-8-14-20(17,18)6/h7,10,17-18H,3,8-9,11-14H2,1-2,4-6H3
charge 1 multiplicity 1
53 atoms
C  3.05491924 -1.99934288 -0.49635083
C  1.52588307 -2.01456908 -0.41656122
C  0.955454 -0.84983828 0.42079226
C  1.54609583 0.50640679 -0.08272364
C  3.09510446 0.57054279 -0.31321988
C  3.52954332 -0.68087044 -1.11017246
H  1.15891537 -1.95110295 -1.44646384
H  1.16175281 -2.96630811 -0.00874188
H  3.50310761 -2.15180024 0.49126163
H  3.39252731 -2.83799741 -1.11426967
H  1.12597152 0.64158376 -1.08955628
H  3.12476111 -0.60604141 -2.12974445
H  4.62070628 -0.67361695 -1.21093959
C  3.93425119 0.68089293 0.97613044
H  4.98912936 0.79308778 0.70647848
H  3.66636121 1.55878366 1.57169954
H  3.85878565 -0.19543124 1.62011872
C  3.41138644 1.811284 -1.17486842
H  3.23734378 2.74787052 -0.63548792
H  4.46513015 1.80384897 -1.47074251
H  2.81029243 1.82550252 -2.09126865
C  -0.60456338 -0.78530554 0.28363859
H  -0.99952929 -1.67251838 0.80013686
C  -1.15859803 0.44970101 0.96973153
C  -0.41925094 1.58222992 1.11456926
H  -1.9528714 2.25288192 -0.69885978
H  -0.88042445 2.4558204 1.57497587
C  1.02361367 1.67834515 0.7662713
H  1.57828311 1.7601271 1.71267879
H  1.19845379 2.63701008 0.26364436
C  -1.18439398 -0.80756288 -1.15080698
H  -0.70314124 -1.59250094 -1.73522779
H  -0.96036351 0.1346937 -1.65601826
C  1.24246304 -1.12898549 1.91351137
H  0.7175468 -2.0384538 2.22516634
H  2.30133488 -1.29002234 2.10502571
H  0.91187344 -0.31930083 2.56874924
C  -3.68045641 -0.31507493 -0.39460984
C  -2.52739648 0.45105232 1.38560075
H  -2.95616563 -0.46730539 1.77295711
H  -2.92767788 1.34448073 1.85871915
C  -2.69353761 -1.1264479 -1.20841579
H  -3.03083631 -1.04624961 -2.25283762
H  -2.83035426 -2.17782326 -0.93674195
C  -4.81321757 -1.09821115 0.20892068
H  -5.47040088 -0.48466206 0.8288031
H  -5.41170486 -1.51279475 -0.61259318
H  -4.45199133 -1.95304303 0.78914491
C  -3.7203253 1.06987153 -0.36640227
H  -4.5571118 1.50878121 0.17334637
C  -2.90290312 2.00296596 -1.19562336
H  -3.44765921 2.93507242 -1.35689997
H  -2.64807498 1.56867008 -2.16527931
