program: Gaussian 16
title: Title Card Required
version: ES64L-G16RevC.01
method: RB3LYP
basis: 6-31+G(d,p)
operation: Freq
keyword: #N
keyword: Geom=AllCheck
keyword: Guess=TCheck
keyword: SCRF=Check
keyword: GenChk
keyword: RB3LYP/6-31+G(d,p)
keyword: Freq
converged: YES YES NO YES
title: Mulliken charges:
elementType: C C C C C C H H H H H H H C H H H C H H H C H C C H H C H H C H H C H H H C C H H C H H C H H H C H H C H
charge: -0.459035 -0.031528 -0.442771 -0.206761 0.276330 -0.180790 0.155453 0.147301 0.146515 0.156252 0.137423 0.145525 0.153647 -0.519190 0.162559 0.147235 0.132093 -0.346889 0.148038 0.165568 0.150378 0.096654 0.122857 -0.438781 -0.109060 0.183028 0.156290 -0.293373 0.148662 0.156601 0.145579 0.183012 0.191059 -0.528791 0.148954 0.166555 0.153288 0.083780 -0.496030 0.172462 0.196992 -0.355707 0.174711 0.173894 -0.285178 0.175872 0.176172 0.177492 -0.278118 0.229652 0.198295 -0.051913 0.187738
chargesum: 1.00000
title: Mulliken charges with hydrogens summed into heavy atoms:
elementType: C C C C C C C C C C C C C C C C C C C C
charge: -0.156267 0.271226 -0.442771 -0.069338 0.276330 0.118382 -0.077303 0.117095 0.096654 -0.438781 0.230257 0.011890 0.519650 -0.059993 0.083780 -0.126576 -0.007102 0.244358 0.272686 0.135825
1716.lowfreq: -1181.9640 -0.0007 -0.0004 0.0003 4.5063 7.3243 8.6180 50.9097 59.9521
frequency: -1181.9640 50.8998 59.9434 114.9018 144.5421 156.0735 176.9117 185.0854 198.6526 219.5272 232.3616 238.1561 241.5996 254.6328 263.5188 288.7909 304.1934 312.5642 317.4207 334.4301 348.5142 357.2188 379.8599 393.4648 408.2187 422.8312 436.8717 455.3282 467.4398 482.6295 500.6996 529.5648 539.5191 543.0726 563.8664 591.1952 647.9653 699.9079 719.6952 752.1633 756.9553 790.8616 817.2221 828.9197 840.4110 865.4484 880.2904 895.0400 913.8589 928.5005 944.8626 948.7414 955.0531 968.8374 985.5674 989.6475 993.6735 1001.3393 1013.6606 1027.6552 1042.6083 1057.4732 1060.7424 1063.6208 1069.9035 1083.5898 1094.2375 1112.2998 1122.7214 1137.1512 1149.4571 1160.6353 1168.2524 1181.0010 1197.1335 1205.0029 1220.2037 1231.7399 1239.9395 1241.5973 1253.0701 1261.6138 1272.5282 1282.4305 1306.3909 1310.0984 1319.6299 1330.0403 1348.0182 1352.6996 1366.3272 1373.6117 1376.0997 1380.5186 1385.5242 1395.8072 1402.6102 1408.9052 1414.7060 1419.4581 1421.2746 1439.9698 1449.6287 1461.3144 1470.2994 1484.4474 1486.7031 1490.0744 1492.0069 1498.1913 1498.3603 1502.1593 1507.7737 1510.0847 1513.5868 1514.2375 1519.5661 1527.0486 1529.3698 1593.7710 1617.4272 2979.3088 2982.2469 3016.8161 3020.1198 3022.9718 3039.8013 3044.1186 3050.4308 3052.7031 3054.5412 3056.0874 3059.7199 3060.4410 3077.2047 3078.6080 3082.2484 3090.5098 3091.9187 3101.9447 3107.0719 3109.0578 3112.6125 3116.9771 3122.6227 3125.6633 3129.5264 3130.5163 3133.4894 3144.5482 3160.0475 3180.5552 3221.5540
redmass: 1.1400 3.1951 3.2123 2.6753 2.9195 2.6689 1.1402 2.6327 2.3105 1.8450 1.7256 2.1097 1.2305 1.3504 1.8593 1.7154 2.0191 2.4552 2.3652 2.3939 2.2724 2.5495 2.6938 2.6092 2.1330 2.2137 2.3115 2.3978 3.1910 2.6952 2.9335 2.4950 2.7326 2.6797 2.0275 2.6793 2.4268 2.7876 1.5459 2.8954 2.2663 2.3523 1.4096 1.7354 2.2699 1.6497 1.8691 2.1643 1.9810 1.7971 1.7745 1.6174 2.0102 1.7744 1.9040 1.7417 1.7194 2.1666 1.5193 1.8824 1.7664 1.3852 1.6472 1.7849 1.9037 1.9626 2.4059 2.2926 1.7042 1.7259 1.7262 1.7287 1.2883 2.4275 1.4935 2.0072 1.8634 2.5441 1.7367 1.8489 1.5310 1.3166 1.4803 1.3432 1.6182 1.2481 1.5787 1.3604 1.4461 1.4302 1.3471 1.5053 1.4684 1.4767 1.4440 1.4743 1.5142 1.5831 1.3458 1.2188 1.2078 1.2292 1.2607 1.0976 1.0827 1.0982 1.0744 1.0490 1.0679 1.0722 1.0605 1.0619 1.0696 1.0798 1.0982 1.0636 1.0725 1.0682 1.0536 2.7323 5.0722 1.0823 1.0738 1.0625 1.0654 1.0647 1.0373 1.0967 1.0351 1.0623 1.0609 1.0405 1.0458 1.0607 1.0941 1.0723 1.0919 1.1024 1.1040 1.0642 1.1050 1.1011 1.1017 1.1013 1.0968 1.0860 1.1031 1.0978 1.1040 1.0984 1.0899 1.0944 1.1083
irintensity: 2487.0731 0.0829 0.0730 0.1200 0.2273 3.9253 0.0947 0.0789 4.3423 0.1268 4.7059 0.9726 1.0696 0.8408 1.1204 0.6377 0.2439 0.1024 1.4762 0.8156 2.0221 6.6245 4.2355 25.5048 5.0047 10.2946 0.9924 1.5674 4.8120 1.9852 4.4217 1.9793 2.3048 8.1678 0.1208 1.8439 7.8316 1.0199 47.2155 10.6626 12.5451 0.6155 3.6645 0.2398 0.6421 4.8644 12.3336 1.9972 1.3559 0.2578 0.3773 1.8432 1.8087 2.0223 10.7210 5.2871 1.8338 7.8264 0.8576 17.1870 14.0228 1.3234 3.8152 2.7672 3.4113 0.3780 6.0721 2.3185 1.9587 0.4206 18.0802 3.7002 5.4374 1.0598 2.2992 2.8311 0.8140 2.7911 0.2089 5.5968 8.1787 18.8523 11.8317 26.7108 2.0543 13.2306 4.0236 1.5281 0.3371 0.3549 0.3457 1.5780 0.5093 1.6775 2.1830 0.9631 2.7646 3.3946 2.7962 1.0183 19.3798 10.8972 4.1383 7.1480 8.2491 7.4622 1.7665 3.5100 2.0519 5.1316 11.6244 6.0514 10.9125 7.0454 26.5201 6.3667 1.3401 4.1794 17.0079 33.8286 33.6304 12.8874 9.9320 17.3394 16.0345 31.9763 28.6624 8.3091 10.2881 12.3530 15.7582 15.4126 14.2037 20.2735 30.5017 21.4071 29.4353 5.4573 34.7315 6.0115 8.0324 27.2033 7.2508 44.9163 42.1250 0.2973 6.8890 8.4227 9.4735 25.2771 1.0382 15.7377 0.8963
temp: 298.150 k
press: 1.00000 atm
elementType: 6 6 6 6 6 6 1 1 1 1 1 1 1 6 1 1 1 6 1 1 1 6 1 6 6 1 1 6 1 1 6 1 1 6 1 1 1 6 6 1 1 6 1 1 6 1 1 1 6 1 1 6 1
symmnumber: 1
zpe: 1272608.1 jmol-1
zpe.correction: 0.484711 hartree
zpe.thermalcorrener: 0.504316 hartree
zpe.thermalcorrenthalpy: 0.505260 hartree
zpe.thermalcorrgfe: 0.440319 hartree
zpe.sumelectzpe: -781.400006 hartree
zpe.sumelectthermal: -781.380401 hartree
zpe.sumelectthermalent: -781.379457 hartree
zpe.sumelectthermalfe: -781.444398 hartree
dipole: -7.4698 0.1145 1.1935
dipole: 7.5654
quadrupole: -80.8761 -113.5763 -115.4855
quadrupole: -0.1568 -3.2019 0.3467
quadrupole: 22.4366 -10.2637 -12.1729 -0.1568 -3.2019 0.3467
hfenergy: -781.8847167 hartree
pointgroup: C01 [X(C20H33)]
dipole: -2.8367506 -0.6606229 -0.6130011 debye
polarizability: 264.3066293|10.0373261|202.1959246|23.0432871|10.630602|198.3871485 unknown
InChI: InChI=1/C20H33/c1-6-19(4)13-10-16-15(14-19)8-9-17-18(2,3)11-7-12-20(16,17)5/h6,17H,7-14H2,1-5H3
charge 1 multiplicity 1
53 atoms
C  3.07394243 -0.96751429 2.06129236
C  1.68030403 -0.9601248 1.42504924
C  0.63595603 -0.20398943 2.28857765
C  1.1944314 1.22212443 2.61720135
C  2.63628993 1.29425069 3.21337959
C  3.57613561 0.4513385 2.32254487
H  1.74825783 -0.47485261 0.44177095
H  1.3551204 -1.99173619 1.25516663
H  3.06549078 -1.54953945 2.98955524
H  3.76414292 -1.48807087 1.38912086
H  1.29099432 1.70267145 1.63025761
H  3.69311573 0.96458185 1.35773639
H  4.57183797 0.42287355 2.77925323
C  2.73301316 0.84471408 4.68471518
H  3.7283955 1.08361754 5.07208004
H  2.00703969 1.36643754 5.31593407
H  2.58666816 -0.22739032 4.82157673
C  3.12677361 2.75636403 3.14270969
H  2.61610329 3.40494936 3.86030176
H  4.19514927 2.79940404 3.37641453
H  2.9895733 3.17745856 2.14032898
C  -0.68061232 -0.0345311 1.51131072
H  -2.1629657 -0.10698375 2.63350967
C  -1.4874294 1.0700221 1.68205621
C  -1.09246528 2.25469839 2.52637601
H  -0.92293193 3.08969217 1.83059228
H  -1.95135805 2.56340539 3.1373614
C  0.14842068 2.03201119 3.39040155
H  -0.12783768 1.52118657 4.31771884
H  0.54824411 3.00316768 3.68666239
C  -1.13244765 -1.17259044 0.62411189
H  -1.32509916 -2.0397374 1.27896091
H  -0.30213905 -1.4874232 -0.010281
C  0.29443141 -1.07121367 3.53057957
H  -0.25087407 -1.97173461 3.23022986
H  1.19360922 -1.40572019 4.04348399
H  -0.31879692 -0.53120148 4.25564695
C  -3.44250006 -0.10595019 0.55318628
C  -2.78235279 1.24094995 0.89905799
H  -3.4626647 1.88931484 1.46263108
H  -2.57148758 1.7749323 -0.03460545
C  -2.37629621 -0.90606857 -0.23929599
H  -2.11279401 -0.31776312 -1.12473021
H  -2.78826615 -1.85610262 -0.59416534
C  -4.73621925 0.07909964 -0.26115394
H  -5.18471983 -0.88423087 -0.52011448
H  -5.47301019 0.66683906 0.29340901
H  -4.50373769 0.60690757 -1.19109142
C  -3.43953693 -0.44285475 3.0564955
H  -3.60312165 0.61278513 3.28690244
H  -3.49297925 -1.11427402 3.90823935
C  -3.70238075 -0.9136247 1.78930533
H  -3.8884208 -1.97822137 1.64325455
