program: Gaussian 16
title: Title Card Required
version: ES64L-G16RevC.01
method: RB3LYP
basis: 6-31+G(d,p)
operation: Freq
keyword: #N
keyword: Geom=AllCheck
keyword: Guess=TCheck
keyword: SCRF=Check
keyword: GenChk
keyword: RB3LYP/6-31+G(d,p)
keyword: Freq
converged: YES YES NO YES
title: Mulliken charges:
elementType: C C C C C C H H H H H H H C H H H C H H H C H C C H H C H H C H H C H H H C C H H C H H C H H H C H H C H
charge: -0.478142 -0.022831 -0.425921 -0.233055 0.282081 -0.189003 0.146365 0.131504 0.146355 0.148763 0.131909 0.141471 0.149214 -0.520005 0.157971 0.147525 0.132690 -0.356579 0.146819 0.161448 0.146950 0.308109 0.185151 0.142451 -0.405283 0.169072 0.146697 -0.277790 0.149340 0.147720 -0.150907 0.170534 0.163953 -0.503160 0.138574 0.156073 0.152368 0.221291 -0.495531 0.197522 0.189292 -0.627318 0.223720 0.218238 -0.496076 0.230711 0.217911 0.199639 -0.566796 0.181306 0.175065 0.319011 0.173582
chargesum: 1.00000
title: Mulliken charges with hydrogens summed into heavy atoms:
elementType: C C C C C C C C C C C C C C C C C C C C
charge: -0.183023 0.255039 -0.425921 -0.101146 0.282081 0.101682 -0.081819 0.098638 0.308109 0.142451 -0.089515 0.019271 0.183580 -0.056145 0.221291 -0.108717 -0.185360 0.152185 -0.025275 0.492593
1716.lowfreq: -8.7868 -4.5426 -0.0007 -0.0001 0.0006 5.1688 25.3141 37.9871 51.5576
frequency: 25.2564 37.9784 51.5335 75.3013 117.4575 126.5754 141.7135 159.3084 166.4169 189.9785 196.8985 217.5395 228.6125 254.9709 275.6375 281.7397 300.5139 306.4017 314.8555 319.8489 331.7076 342.0874 352.2889 369.5014 390.1200 411.3639 433.2083 441.3978 444.4416 465.4693 490.9080 534.8040 545.0696 562.2464 581.5463 627.4732 663.8074 679.7189 731.0545 745.3301 758.1055 782.3955 794.1642 823.2570 858.2394 869.6557 898.9966 900.2537 918.3486 936.3502 948.3157 962.2607 968.2604 982.8147 989.9988 997.2944 1004.0823 1010.6959 1024.9214 1038.9867 1059.9376 1061.8386 1066.8751 1070.9203 1086.7522 1091.7975 1105.8796 1128.9473 1137.0107 1166.8422 1170.3308 1178.8637 1187.0617 1206.3395 1219.7107 1225.5105 1237.5992 1241.7373 1249.0336 1254.2545 1271.9176 1287.5508 1306.5222 1327.5150 1334.0703 1349.5453 1358.6135 1364.5114 1367.7331 1373.1273 1379.6055 1383.7801 1384.8123 1397.8234 1401.7389 1408.0465 1412.2755 1421.1349 1421.8081 1435.9892 1437.2753 1456.2957 1469.0200 1474.8193 1479.4438 1485.6563 1489.2770 1490.1889 1491.0504 1496.8216 1501.3907 1506.7803 1508.5265 1511.2376 1513.6336 1517.4076 1522.8537 1526.7090 1527.6503 1706.2535 2975.7806 2978.9791 2997.1905 3000.6369 3005.5415 3008.8840 3015.9788 3020.8408 3033.5859 3037.7337 3048.2828 3051.5244 3054.2595 3058.5102 3060.3128 3070.3230 3072.9885 3075.1374 3078.1558 3086.8934 3089.0891 3092.6357 3105.9188 3110.4140 3114.5472 3120.9884 3126.2907 3140.5450 3142.0647 3146.1166 3168.7575 3172.9813 3207.5899
redmass: 3.0163 2.9074 2.5799 2.4625 1.8629 1.5997 1.3298 1.8701 1.1621 1.5557 2.3651 1.9652 2.1735 1.2125 1.8873 2.1374 2.4170 1.9388 2.0964 2.6895 2.4597 2.1976 2.5944 2.6069 2.5712 2.7373 2.3124 1.9425 3.0714 3.0848 2.8959 2.7847 2.7358 2.0829 2.6246 2.9622 3.1339 2.6649 2.4274 3.0751 3.1547 2.3499 2.3599 1.7474 2.0148 1.6675 1.7859 2.2649 2.0325 1.8758 1.5779 1.9408 1.7578 1.8582 1.7135 1.9426 2.0699 1.5825 2.3704 1.9637 2.0944 1.6567 1.6267 1.8263 1.9705 1.8865 2.4598 2.0769 2.0422 1.7006 1.7155 2.2853 1.4061 1.7004 2.3089 1.7285 1.6460 1.6990 1.4603 1.3604 1.5398 1.2749 1.6044 1.3334 1.4117 1.4021 1.3046 1.3533 1.1419 1.3947 1.4554 1.3828 1.3366 1.5141 1.5159 1.4114 1.3065 1.2149 1.2197 1.2209 1.2291 1.2547 1.1546 1.3659 1.0885 1.0793 1.0810 1.0547 1.0665 1.0755 1.3054 1.0747 1.0806 1.2338 1.0687 1.0779 1.1047 1.0655 1.0585 7.8472 1.0686 1.0820 1.0657 1.0851 1.0549 1.0650 1.0658 1.0656 1.0939 1.0372 1.0639 1.0592 1.0439 1.0583 1.0949 1.0965 1.0902 1.0414 1.0667 1.1035 1.0850 1.0794 1.1009 1.1018 1.1008 1.0939 1.0984 1.1034 1.0990 1.0863 1.1046 1.0956 1.0974
irintensity: 0.3407 0.6432 8.5078 0.4915 0.7037 0.0261 0.1124 1.3700 0.7742 3.9056 2.8062 1.4049 1.8566 0.0301 0.1094 1.1589 0.4471 0.2201 1.5539 0.4432 1.4173 0.6749 0.7302 0.8007 0.3164 2.5697 0.1780 5.4402 0.0782 3.9158 0.8154 2.3701 4.5797 0.7537 2.1061 9.1735 1.7394 1.1585 0.5529 10.2012 53.0048 4.4661 0.2348 1.6584 7.7539 3.0098 6.6715 7.0993 5.0213 11.3953 8.2642 5.0398 8.9027 6.4852 3.2103 1.8472 4.1657 0.9549 9.0877 11.6111 9.1445 2.3731 20.1304 3.5879 1.5323 5.1388 1.6507 3.7141 5.4885 15.8033 6.7859 3.1206 22.7739 8.5563 0.5394 10.3537 3.3520 4.2445 15.3348 3.8462 12.6921 7.9506 6.9284 1.2562 20.5837 1.7110 30.8977 3.8279 45.8796 8.4189 1.0240 2.0596 10.4490 1.2650 2.2204 7.2992 5.0460 3.8450 14.9061 3.7125 12.8647 16.9662 1.5063 15.3367 3.2690 0.8944 12.1537 1.2705 4.7183 0.4150 9.0602 5.8044 9.8646 13.2874 14.6513 1.1396 16.5756 1.0497 14.8722 1.2675 28.4408 15.0840 27.3465 8.8782 26.9626 31.3071 32.1767 21.1773 26.1245 31.5325 14.1045 4.3851 13.6616 19.7306 7.5367 50.2536 41.7642 8.9844 20.0184 40.1429 10.4931 2.5010 29.5299 8.5208 49.8372 52.1972 7.8653 4.0534 23.0013 4.6022 5.7043 23.6148 3.1721
temp: 298.150 k
press: 1.00000 atm
elementType: 6 6 6 6 6 6 1 1 1 1 1 1 1 6 1 1 1 6 1 1 1 6 1 6 6 1 1 6 1 1 6 1 1 6 1 1 1 6 6 1 1 6 1 1 6 1 1 1 6 1 1 6 1
symmnumber: 1
zpe: 1283094.3 jmol-1
zpe.correction: 0.488705 hartree
zpe.thermalcorrener: 0.509807 hartree
zpe.thermalcorrenthalpy: 0.510751 hartree
zpe.thermalcorrgfe: 0.440531 hartree
zpe.sumelectzpe: -781.407237 hartree
zpe.sumelectthermal: -781.386135 hartree
zpe.sumelectthermalent: -781.385191 hartree
zpe.sumelectthermalfe: -781.455412 hartree
dipole: 13.2120 0.8070 -1.4038
dipole: 13.3108
quadrupole: -53.6165 -112.5355 -118.4169
quadrupole: 3.0719 -7.4838 -1.8976
quadrupole: 41.2398 -17.6792 -23.5606 3.0719 -7.4838 -1.8976
hfenergy: -781.8959423 hartree
pointgroup: C01 [X(C20H33)]
dipole: 5.1995394 0.3464366 -0.5192848 debye
polarizability: 261.3519302|1.6094755|212.978155|-3.5339239|-2.229922|183.1303625 unknown
InChI: InChI=1/C20H33/c1-14-7-9-17-16(13-15(14)2)8-10-18-19(3,4)11-6-12-20(17,18)5/h15,18H,6-13H2,1-5H3
charge 1 multiplicity 1
53 atoms
C  -2.86838594 2.12952639 -0.29560097
C  -1.35252158 1.90866888 -0.33382417
C  -0.91042698 0.57665147 0.32960012
C  -1.75441844 -0.57712936 -0.30889752
C  -3.30602014 -0.39833722 -0.35606661
C  -3.62056307 0.98394317 -0.96660641
H  -1.0224385 1.9121664 -1.38296363
H  -0.87464645 2.76131398 0.15994722
H  -3.20354982 2.25229349 0.74039964
H  -3.1006013 3.07427364 -0.79924187
H  -1.45479106 -0.56727015 -1.36919065
H  -3.35163931 0.9632432 -2.03236942
H  -4.70164121 1.16037856 -0.92373114
C  -4.00462184 -0.55999882 1.0085381
H  -5.08862111 -0.59922115 0.86009729
H  -3.71100657 -1.49011282 1.50464903
H  -3.8054926 0.26268949 1.69646354
C  -3.89752009 -1.46262744 -1.30570925
H  -3.86289796 -2.46980083 -0.88063582
H  -4.94942128 -1.23537197 -1.50666739
H  -3.37132883 -1.47771084 -2.26705213
C  0.59393685 0.28678211 0.07410167
H  2.31648269 -0.00128647 2.09816156
C  1.050683 -0.97259387 -0.09261738
C  0.1479558 -2.1914578 -0.13897571
H  0.18223364 -2.6029892 -1.15995279
H  0.57295096 -2.97339305 0.50476347
C  -1.30100152 -1.922375 0.25666101
H  -1.39780111 -1.93326672 1.34609844
H  -1.92388474 -2.73809537 -0.11536845
C  1.50506414 1.50402058 0.15690336
H  1.74740966 1.73376327 1.20117558
H  0.95857502 2.37715291 -0.19581485
C  -1.05461178 0.71511904 1.86694366
H  -0.35721338 1.47129801 2.2433984
H  -2.05301913 1.03548714 2.16024279
H  -0.83546733 -0.22134744 2.38424535
C  3.80155189 0.44618664 -0.47612482
C  2.48923872 -1.40776694 -0.31275266
H  2.62132024 -2.42936725 0.06336479
H  2.71646909 -1.4810896 -1.38582477
C  2.78292151 1.48535593 -0.67550212
H  2.54429529 1.46306683 -1.75276278
H  3.33070498 2.44124655 -0.57725157
C  4.97453237 0.45188849 -1.3759551
H  5.82429269 0.79738348 -0.76245905
H  5.24448501 -0.56185934 -1.69015602
H  4.87090641 1.11225489 -2.23738465
C  3.3163741 -0.39901008 1.94948994
H  3.37056855 -1.36421578 2.45925502
H  4.0494234 0.26687591 2.41158302
C  3.66427734 -0.63883731 0.47293295
H  4.55022344 -1.27725805 0.41806498
