program: Gaussian 16
title: Title
version: ES64L-G16RevC.02
basis: 6-311++G(2d,2p)
method: RB3LYP
operation: Freq
keyword: #p
keyword: freq
keyword: b3lyp/6-311++g(2d,2p)
keyword: nosymm
keyword: int=superfinegrid
keyword: scf=xqc
keyword: iop(7/90=-1)
title: #p freq b3lyp/6-311++g(2d,2p) nosymm int=superfinegrid scf=xqc iop(7/9
basis: NPDir=0 NMtPBC= 1 NCelOv= 1 NCel= 1 NClECP= 1 NCelD= 1
basis: NCelK= 1 NCelE2= 1 NClLst= 1 CellRange= 0.0.
basis: One-electron integrals computed using PRISM.
basis: NBasis= 1493 RedAO= T EigKep= 1.17D-05 NBF= 1493
basis: NBsUse= 1493 1.00D-06 EigRej= -1.00D+00 NBFU= 1493
converged: NO NO NO NO
title: Mulliken charges:
elementType: O H H O H H O H H C C O O H H H C C O O H H H C C O O H H H P P P C O O O O O O O O O O H H H Mg H H H C H C H H H O H C H C H H H O H C H C H H H O H K
charge: -0.612101 0.350490 0.247731 -0.495892 0.244647 0.377981 -0.751860 0.461498 0.291403 -0.037843 0.309761 -0.610763 -0.638132 -0.000391 0.023815 0.083213 -0.394583 0.681684 -0.574972 -0.618669 0.109182 0.080953 0.041635 -0.178501 0.358913 -0.723649 -0.650169 0.031145 0.169176 0.097754 1.471728 1.688262 1.004228 -0.019519 -0.546877 -0.886393 -0.708346 -0.822058 -0.696269 -0.848273 -0.779333 -0.604304 -0.569743 -0.533006 0.065181 0.093874 0.130961 0.277776 0.057695 0.052112 0.051823 0.146320 0.064338 -0.343351 0.068540 0.121084 0.059619 -0.388829 0.238276 0.051364 0.023131 -0.235411 0.183449 0.037695 -0.008605 -0.466635 0.317187 0.147678 0.035633 -0.380285 0.129560 0.073021 0.061690 -0.515988 0.359558 0.667984
chargesum: -4.00000
polarizability: 7.66737501e+02 -1.52930112e+02 1.14421496e+03 -3.95267202e+02 9.12423479e+02 3.12556519e+03
frequency: 19.2723 20.9615 33.2390 41.3629 48.1926 50.2461 55.4420 64.1639 66.7500 69.0981 74.5864 80.1636 83.2343 88.5327 94.5130 103.7148 115.2460 117.2154 125.6295 134.3597 142.1247 146.4208 152.7599 156.2779 158.3782 164.3349 167.4348 179.5070 183.5759 190.7829 191.8535 192.4868 201.5867 207.7348 214.0259 220.0612 222.0689 247.4125 259.5167 264.4938 268.2982 268.5069 279.2356 293.9938 309.8925 322.3888 324.1300 328.3726 332.8457 343.0808 347.2553 347.7154 357.9902 362.7485 376.9140 394.3769 397.2143 415.3165 425.7840 445.1128 473.7675 494.0219 508.5537 516.4621 527.7077 536.8117 548.8654 552.3726 581.6288 590.9023 592.3366 627.1909 635.1441 649.1080 654.9429 661.6023 661.7654 664.6170 665.4825 702.7670 709.2526 721.4413 725.2967 726.4940 732.8843 741.4945 754.9162 762.0072 763.0598 774.9721 825.4748 837.2482 841.8921 870.3749 892.9045 910.0370 934.3010 943.9104 956.3446 962.6318 979.2022 992.1337 1005.2328 1008.8261 1012.8588 1062.2018 1078.6544 1088.3212 1098.7825 1103.4450 1115.5479 1118.5182 1146.2039 1148.9890 1160.9791 1164.1298 1170.8180 1189.6288 1211.3656 1212.7291 1222.5974 1228.2447 1238.6141 1254.7054 1285.3613 1326.0139 1362.6095 1370.0030 1373.6988 1377.9892 1384.8709 1396.8828 1401.8627 1404.5597 1406.1445 1408.6606 1455.8048 1459.2329 1465.8762 1481.2784 1485.5926 1487.3059 1496.8829 1498.5340 1501.6557 1505.2983 1583.7635 1588.5700 1692.7373 1706.5160 1709.3562 2877.5083 2926.7456 2938.2564 2947.8777 2960.3761 2962.4241 2982.4011 2985.2186 2998.2567 3000.9724 3006.0115 3014.5530 3014.6719 3015.1734 3025.8902 3062.8084 3064.3966 3070.5991 3080.0546 3086.9521 3104.6206 3109.6770 3155.1677 3178.7569 3486.4491 3628.1281 3794.0047 3839.2894 3853.9046
redmass: 13.7303 11.3734 15.6708 10.5207 10.9079 10.6770 11.1713 7.1284 5.1098 10.9518 8.2351 5.6985 4.6802 4.1102 11.6965 9.5435 7.5180 8.3645 10.0326 7.5701 8.9009 8.1539 8.0107 6.9214 6.3529 2.8202 2.6882 3.4802 5.3223 2.2270 1.9269 1.4158 6.2016 1.2790 8.0941 9.9291 7.4141 1.0776 5.5591 5.4105 2.8878 8.8507 11.9833 8.6011 7.9861 8.0415 3.9473 3.9924 11.2027 4.7564 5.5727 8.3329 2.5068 2.9722 7.7371 14.3920 8.0095 6.4916 12.3674 5.9230 14.9096 15.8505 5.9829 2.4536 5.5901 2.8859 9.4206 1.3182 6.5523 1.3799 1.2699 1.1678 1.1753 3.9201 3.7766 2.0846 2.6011 4.0578 3.3127 1.1475 10.5582 4.7898 5.5338 5.7247 1.0810 1.4849 3.2253 3.2764 2.7714 2.6356 7.0834 12.1373 10.4103 1.1397 9.0567 1.1331 12.4334 1.1758 1.2267 1.1771 1.0482 7.5523 1.3287 1.3223 1.3072 14.5044 1.1286 14.2786 1.0578 1.0980 10.1066 1.0692 1.1368 13.2650 1.0644 1.1104 1.1032 1.0678 1.1878 1.0697 1.1100 6.1584 1.8551 2.0933 1.0976 1.0621 11.2636 1.0764 7.5102 1.2455 1.2338 1.3274 1.1409 1.0288 1.2344 2.8087 1.0252 1.0789 1.0397 1.0453 1.0405 1.0771 1.0448 1.0471 1.0650 8.5496 9.1965 9.5224 1.0706 1.0765 1.0793 1.0083 1.0080 1.0754 1.0083 1.0085 1.0082 1.0079 1.0081 1.0161 1.0080 1.0427 1.0079 1.0082 1.0309 1.0359 1.0924 1.0934 1.0716 1.0999 1.1008 1.1011 1.0996 1.0742 1.0758 1.0592 1.0741 1.0640 1.0667 1.0649
irintensity: 13.5301 21.6621 3.9032 4.2938 13.6741 10.0920 12.2867 21.8244 0.4178 1.4422 0.9643 18.8630 14.5550 5.8168 44.4220 6.1938 38.7545 5.3277 11.1833 9.4744 15.4010 8.4433 39.8509 24.0505 1.9905 1.8266 4.2709 4.2311 13.8789 3.7199 2.1814 2.4935 5.0376 3.6867 2.4641 6.7942 9.2729 30.2730 6.9494 1.3574 16.1915 12.3692 1.4804 18.6807 3.9756 10.5252 3.6621 9.3547 3.9855 5.5903 79.6300 20.0531 23.6482 61.5053 84.6250 14.1105 7.5531 3.2581 55.1049 1.0068 154.5119 46.5400 530.5204 149.7201 136.3043 182.7954 313.1953 5.5537 157.8925 2.8990 25.2224 230.8262 199.5564 88.9760 39.9372 55.3190 124.4830 184.4261 268.2963 160.6712 443.1123 29.1811 98.0792 44.9149 2.9193 2420.4222 513.0848 29.8225 11.3729 2551.4494 31.5666 11.1972 757.4544 89.0802 41.7722 17.9598 539.1319 3.7302 12.8146 4.7425 59.0410 65.0101 1.7946 0.8787 1.5058 646.3889 64.9441 123.3588 13.0949 91.2347 66.6662 2.3721 52.7328 437.1535 29.2416 57.7598 15.4911 3.4726 49.9117 9.5804 9.2287 225.5087 196.6738 170.0041 4.3749 0.3333 1645.5531 7.4031 109.7619 2.1833 24.0204 125.6097 79.9629 38.7053 1.5183 277.4404 2.9509 79.4892 34.8416 4.2739 2.7370 52.2816 1.0234 3.2257 15.8930 202.7800 724.4215 1834.3871 3.9759 108.4894 86.0351 372.6572 262.5958 3030.0756 40.4650 48.2402 8.2154 16.4744 167.4379 9.8560 11.0740 474.0274 10.9011 46.3250 4.5668 19.3930 73.7057 54.7692 1119.0752 36.5027 43.8360 0.2008 53.4150 4965.7255 2102.9980 6587.7121 161.2215 92.2221 31.0034 36.8148
temp: 298.150 k
press: 1.00000 atm
elementType: 8 1 1 8 1 1 8 1 1 6 6 8 8 1 1 1 6 6 8 8 1 1 1 6 6 8 8 1 1 1 15 15 15 6 8 8 8 8 8 8 8 8 8 8 1 1 1 12 1 1 1 6 1 6 1 1 1 8 1 6 1 6 1 1 1 8 1 6 1 6 1 1 1 8 1 19
symmnumber: 1
zpe: 1186240.1 jmol-1
zpe.correction: 0.451815 hartree
zpe.thermalcorrener: 0.494847 hartree
zpe.thermalcorrenthalpy: 0.495791 hartree
zpe.thermalcorrgfe: 0.374931 hartree
zpe.sumelectzpe: -3997.162744 hartree
zpe.sumelectthermal: -3997.119712 hartree
zpe.sumelectthermalent: -3997.118768 hartree
zpe.sumelectthermalfe: -3997.239628 hartree
dipole: -1394.5340 -752.1208 -1526.8657
dipole: 2200.3931
quadrupole: -101702.1834 -29940.9889 -121841.6047
quadrupole: -54626.4631 -110910.2568 -59749.2399
quadrupole: -17207.2577 54553.9368 -37346.6791 -54626.4631 -110910.2568 -59749.2399
hfenergy: -3997.6145589 hartree
pointgroup: C01 [X(C13H36K1Mg1O22P3)]
dipole: 4.2432593 1.9850424 12.5188672 debye
polarizability: 766.7375006|-152.930112|1144.214964|-395.2672024|912.423479|3125.5651886 unknown
InChI: InChI=1/3C2H3O2.3C2H6O.CH3O10P3.K.Mg.3H2O/c3*1-2(3)4;3*1-2-3;1-9-13(5,6)11-14(7,8)10-12(2,3)4;;;;;/h3*1H3;3*3H,2H2,1H3;1H3;;;3*1H2/q;;-1;;;;-5;+2;+4;;;/rC7H22KMgO16P3.2C2H3O2.C2H6O.H2O/c1-5-16-8(25(6-2)29-8)18-26(13)20-9(11,12,17-7(3)10)21-27(14,23-26)24-28(15-4,19-8)22-9;2*1-2(3)4;1-2-3;/h16H,5-6,11-12H2,1-4H3;2*1H3;3H,2H2,1H3;1H2
charge -4 multiplicity 1
76 atoms
O  74.38942 40.94448 77.09504
H  73.59326 41.51294 77.15081
H  74.59403 40.65248 78.00128
O  71.90392 35.07805 80.50266
H  72.60217 34.9240 81.15086
H  72.33067 34.82655 79.6315
O  70.51556 37.74705 79.56341
H  69.91984 37.43339 78.8128
H  69.94746 37.97327 80.30573
C  73.23611 43.91973 78.73712
C  72.03292 43.66153 77.82067
O  72.11716 42.67795 77.03214
O  71.06931 44.46902 77.89854
H  72.93692 44.15119 79.75994
H  73.77588 44.79246 78.35944
H  73.92408 43.07915 78.75422
C  74.47603 35.99197 76.73699
C  73.60357 35.82127 77.97694
O  73.31352 36.85968 78.63002
O  73.20092 34.65412 78.24939
H  75.29897 36.69002 76.89103
H  73.85514 36.40551 75.93917
H  74.8647 35.03143 76.40541
C  70.0871 38.19898 76.08405
C  68.87322 37.36923 76.52191
O  68.84162 36.97562 77.73133
O  67.97998 37.14184 75.67258
H  70.22493 38.09602 75.00799
H  70.99122 37.90406 76.61228
H  69.90241 39.25138 76.30739
P  71.73625 38.05374 83.55558
P  74.55893 37.46898 82.67155
P  74.37642 39.85438 80.9068
C  71.40098 35.46303 83.91196
O  71.38945 36.78062 84.5068
O  71.24681 37.70663 82.17492
O  73.88972 36.55228 81.66921
O  74.1875 41.08385 81.79008
O  71.25377 39.28884 84.24499
O  75.58609 36.90455 83.58961
O  73.07661 39.17482 80.51483
O  73.36422 38.12445 83.60714
O  75.17567 38.74915 81.93268
O  75.35048 40.0759 79.76178
H  71.45704 34.77705 84.75702
H  72.2765 35.32637 83.28374
H  70.49774 35.29602 83.33057
Mg 72.35999 37.28908 80.46291
H  71.26749 44.03774 86.90471
H  78.45096 40.33277 80.80729
H  76.77062 40.58116 84.80863
C  71.71908 44.26497 85.93901
H  70.95287 44.1035 85.18101
C  72.20401 45.7055 85.89769
H  72.9701 45.88076 86.65581
H  72.62555 45.94353 84.9213
H  71.37616 46.38924 86.09304
O  72.74881 43.32395 85.64824
H  73.49802 43.4522 86.23684
C  78.40589 41.16604 80.10603
H  79.22795 41.83795 80.37239
C  78.61945 40.64272 78.6870
H  77.81209 39.96716 78.4066
H  78.63803 41.46772 77.97269
H  79.56633 40.10041 78.61484
O  77.21437 41.90999 80.25003
H  76.45958 41.28263 80.09286
C  75.68298 40.60397 84.87694
H  75.3036 39.67359 84.46089
C  75.27829 40.73028 86.33734
H  74.19311 40.71336 86.44493
H  75.69051 39.90263 86.9176
H  75.65343 41.66335 86.76457
O  75.19035 41.71974 84.13882
H  75.02481 41.43359 83.20379
K  72.44203 41.79292 83.54205
