program: Gaussian 16
title: Title
version: ES64L-G16RevC.02
basis: 6-311++G(2d,2p)
method: UB3LYP
operation: Freq
keyword: #p
keyword: freq
keyword: ub3lyp/6-311++g(2d,2p)
keyword: nosymm
keyword: int=superfinegrid
keyword: scf=qc
keyword: Guess=mix
keyword: iop(7/90=-1)
title: #p freq ub3lyp/6-311++g(2d,2p) nosymm int=superfinegrid scf=qc Guess=m
basis: NPDir=0 NMtPBC= 1 NCelOv= 1 NCel= 1 NClECP= 1 NCelD= 1
basis: NCelK= 1 NCelE2= 1 NClLst= 1 CellRange= 0.0.
basis: One-electron integrals computed using PRISM.
basis: NBasis= 1493 RedAO= T EigKep= 9.27D-06 NBF= 1493
basis: NBsUse= 1493 1.00D-06 EigRej= -1.00D+00 NBFU= 1493
converged: NO NO NO NO
polarizability: 2.92063264e+03 5.40602896e+02 3.09049650e+03 -2.43695070e+02 1.20394527e+02 4.26258350e+03
frequency: -24.9567 -10.3297 26.2135 29.2305 32.0494 48.5311 59.2639 63.2922 66.3280 69.3815 83.2609 86.9145 87.6842 92.0891 93.1406 104.6332 116.3234 125.9487 128.8668 135.2104 142.3722 154.7914 158.3275 162.6341 166.3145 167.8332 172.8384 178.5338 182.2590 188.4158 192.3754 194.9940 206.5327 210.3823 215.0212 222.1987 229.4450 251.5595 259.1884 265.0337 270.8511 279.7277 284.2721 289.9247 296.6250 311.9109 325.8652 326.6370 335.2909 340.8224 346.1338 351.1962 356.4706 361.6808 394.3894 396.9730 408.9831 410.6146 432.6413 447.0100 471.2933 481.5689 495.0386 498.1930 503.8166 508.0627 524.5170 533.9417 548.5537 578.2858 584.2957 586.7564 598.5682 646.6285 647.2464 647.8021 657.7567 661.6812 665.1904 668.9061 682.9348 711.1495 717.5616 718.4697 720.8073 723.3524 741.3884 744.0234 757.2094 761.9396 762.8499 812.9816 825.6778 829.6153 849.5652 880.6368 908.4607 943.2240 943.7656 955.3387 964.8589 992.0327 1002.9126 1009.0768 1014.9826 1063.1520 1071.7704 1082.3231 1092.2052 1093.5927 1098.3043 1117.0287 1137.0975 1147.9472 1148.9797 1166.9728 1178.3877 1186.3706 1207.2662 1209.5437 1212.8382 1224.4523 1233.4096 1240.3115 1255.4237 1257.1325 1282.7451 1322.7171 1371.4488 1380.2057 1385.8517 1393.3340 1396.5951 1400.3585 1408.1675 1411.2140 1414.5712 1463.7871 1464.4051 1476.9424 1481.7501 1486.2141 1498.0219 1498.3842 1499.9674 1501.4320 1570.2289 1597.0920 1684.7134 1699.5090 1709.3781 2896.4003 2941.8038 2947.3739 2957.6553 2966.1677 2973.7500 2981.9605 2983.9207 2992.7354 2992.8968 3003.5569 3006.3456 3014.7941 3022.7643 3029.2307 3067.4942 3072.7770 3085.8498 3090.9033 3103.4304 3107.2055 3228.4849 3314.5001 3370.7037 3494.6440 3535.6094 3791.7185 3833.0964 3851.1415
redmass: 10.5071 10.9669 11.4910 11.0506 12.7784 13.1386 8.8849 3.9254 8.0176 8.3927 4.4414 3.5107 11.0441 9.9200 8.1574 10.6126 6.5506 11.3230 6.0858 7.5277 7.9165 2.1027 10.7215 4.8301 2.7638 4.9944 6.7847 1.6076 2.7638 8.3635 1.3257 8.9375 9.7396 1.3597 6.8280 10.2817 7.0648 1.3777 3.9213 11.1717 14.5053 8.1082 1.5790 8.0880 8.5175 8.5162 4.1982 4.1490 12.3307 12.5757 4.6955 11.9707 10.0444 14.7588 12.0991 6.7903 2.1553 2.9939 4.0872 5.9014 12.1065 1.2157 2.5855 6.8935 2.4377 12.3607 11.3060 14.8429 12.2918 1.4079 7.2595 1.3471 1.1422 1.4101 1.6392 2.2507 4.6530 3.0878 4.0445 4.2850 1.1592 9.0811 4.5036 2.4800 3.0507 1.8632 1.0735 7.7835 3.0941 3.3582 3.1755 1.1180 1.1365 5.9777 8.7809 1.1022 10.6427 1.1852 12.6921 1.2197 1.1776 9.5494 1.3325 1.3184 1.3093 3.8397 1.4320 1.3427 10.7188 1.1489 1.0580 11.5032 12.6197 1.1266 1.1372 1.0905 1.1294 1.0661 2.9979 1.0882 1.1162 1.1172 9.0934 1.4347 6.4826 3.2074 1.0987 1.0568 1.0712 1.2449 1.2343 1.1065 1.2714 1.0538 1.2335 3.0192 1.1012 1.0246 1.0457 1.0699 1.0450 1.0410 1.0501 1.0521 1.0447 7.1841 9.1409 12.1172 1.0727 1.0715 1.0710 1.0082 1.0080 1.0088 1.0080 1.0081 1.0079 1.0660 1.0119 1.0097 1.0098 1.0097 1.0080 1.0399 1.0346 1.0351 1.0943 1.0969 1.1004 1.1010 1.1018 1.1007 1.0735 1.0746 1.0684 1.0498 1.0834 1.0660 1.0667 1.0643
irintensity: 9.0226 2.5707 12.2382 36.9367 6.3623 12.4379 8.1572 1.8148 11.6164 4.8844 0.6225 0.8792 32.3126 44.3799 4.1125 2.6028 19.3528 11.1573 2.3484 6.4166 26.6353 9.7661 1.8101 25.5741 1.2585 3.1457 7.6439 0.6750 4.2854 9.7713 2.1453 9.3344 2.2780 0.1262 3.6442 4.3979 2.0240 2.2692 1.0503 2.3390 1.2352 5.1881 3.2755 12.9193 6.9322 6.9649 12.1319 1.0998 13.7806 6.6960 14.1862 5.8115 489.7965 29.4028 13.8954 20.9666 108.3883 39.2982 33.8230 5.8530 85.4040 7.3693 18.4547 45.9607 84.0537 334.5552 70.8125 13.7698 296.9119 36.4623 15.1959 9.6464 42.4525 27.3920 54.8608 115.6187 6.8615 225.1947 11.7352 79.6336 20.4916 173.8236 1.2964 80.5494 14.3381 10.2383 0.8350 518.0898 6.4668 14.2304 23.5979 125.4368 81.7189 55.0087 454.6600 22.7683 49.9454 5.0506 517.1958 6.8477 6.4572 26.8384 2.1853 0.1829 4.7477 520.4238 120.2563 353.7315 22.7790 58.9116 16.6176 109.6033 112.6517 14.5520 50.7885 58.4898 9.4987 5.8570 3623.7586 16.9775 18.8507 17.7708 241.3920 134.6149 428.9572 141.3182 8.3365 3.3065 3.7322 6.9540 28.5822 1023.3551 96.9089 92.3800 3.4465 249.6129 92.5844 0.9668 49.5461 60.6764 0.8208 0.6069 28.3275 11.3256 0.4709 4002.0385 1627.7918 1132.9096 33.1699 109.2844 54.0453 197.3454 173.4070 21.9278 32.5030 2.5291 7.3144 849.0256 301.8966 30.3813 280.1985 54.7621 8.9111 388.7739 0.6621 2.4351 87.7023 17.2212 4.1364 19.5029 1.3998 25.8956 4306.7210 787.4322 2740.4594 720.9391 1114.3918 43.3089 7.3275 10.2464
temp: 298.150 k
press: 1.00000 atm
elementType: 8 1 1 8 1 1 8 1 1 6 6 8 8 1 1 1 6 6 8 8 1 1 1 6 6 8 8 1 1 1 15 15 15 6 8 8 8 8 8 8 8 8 8 8 1 1 1 12 1 1 1 6 1 6 1 1 1 8 1 6 1 6 1 1 1 8 1 6 1 6 1 1 1 8 1 19
symmnumber: 1
zpe: 1182525.4 jmol-1
zpe.correction: 0.450400 hartree
zpe.thermalcorrener: 0.491851 hartree
zpe.thermalcorrenthalpy: 0.492796 hartree
zpe.thermalcorrgfe: 0.377643 hartree
zpe.sumelectzpe: -3997.081345 hartree
zpe.sumelectthermal: -3997.039894 hartree
zpe.sumelectthermalent: -3997.038950 hartree
zpe.sumelectthermalfe: -3997.154103 hartree
dipole: -1403.2861 -774.8449 -1556.6595
dipole: 2234.4541
quadrupole: -102981.9818 -31838.5349 -126821.3632
quadrupole: -56555.8844 -113679.3240 -62859.0220
quadrupole: -15768.0218 55375.4251 -39607.4033 -56555.8844 -113679.3240 -62859.0220
hfenergy: -3997.5317456 hartree
pointgroup: C01 [X(C13H36K1Mg1O22P3)]
dipole: 1.7980723 -5.9923843 0.8787526 debye
polarizability: 2920.6326418|540.6028962|3090.496503|-243.6950704|120.3945273|4262.5834977 unknown
InChI: InChI=1/3C2H3O2.3C2H6O.CH3O10P3.K.Mg.3H2O/c3*1-2(3)4;3*1-2-3;1-9-13(5,6)11-14(7,8)10-12(2,3)4;;;;;/h3*1H3;3*3H,2H2,1H3;1H3;;;3*1H2/q;;-1;;;;-5;+2;+4;;;/rC7H22KMgO16P3.2C2H3O2.C2H6O.H2O/c1-5-16-8(25(6-2)29-8)18-26(13)20-9(11,12,17-7(3)10)21-27(14,23-26)24-28(15-4,19-8)22-9;2*1-2(3)4;1-2-3;/h16H,5-6,11-12H2,1-4H3;2*1H3;3H,2H2,1H3;1H2
charge -4 multiplicity 1
76 atoms
O  74.857227 40.814199 77.132918
H  74.048647 41.361771 77.179303
H  75.009514 40.506956 78.050361
O  71.70786 35.195819 80.370832
H  72.12528 34.742982 81.109804
H  72.222504 34.903046 79.557353
O  70.413082 37.750544 79.637409
H  70.291139 38.497796 79.01177
H  70.008668 38.018833 80.47244
C  73.236048 43.919832 78.737098
C  72.109527 43.193622 77.987828
O  72.454951 42.246483 77.193223
O  70.938637 43.576768 78.168281
H  72.936953 44.151144 79.759956
H  73.432214 44.866801 78.23028
H  74.155752 43.340244 78.745359
C  74.475979 35.992025 76.737184
C  73.56709 35.862215 77.951802
O  73.261485 36.91864 78.578728
O  73.142311 34.709963 78.245374
H  75.299004 36.690012 76.890936
H  73.882245 36.377331 75.90523
H  74.871589 35.021521 76.448698
C  70.08703 38.198977 76.084026
C  70.513408 39.511929 76.69603
O  70.248256 39.773499 77.866718
O  71.19744 40.336971 75.933104
H  70.22497 38.096039 75.007987
H  69.040474 38.029215 76.329978
H  70.661492 37.411805 76.575045
P  71.727245 38.042827 83.556219
P  74.543409 37.460663 82.649771
P  74.369299 39.836123 80.866791
C  71.40102 35.463021 83.911971
O  71.360048 36.783979 84.500362
O  71.25022 37.707431 82.165492
O  73.890039 36.565371 81.620642
O  74.180596 41.106591 81.67902
O  71.264436 39.290752 84.227788
O  75.594281 36.891345 83.535338
O  73.062378 39.173447 80.457118
O  73.35923 38.076421 83.610203
O  75.134983 38.772418 81.940201
O  75.378104 39.969477 79.733515
H  71.457004 34.777023 84.757013
H  72.287166 35.339602 83.29395
H  70.503423 35.28069 83.326874
Mg 72.360019 37.288957 80.462845
H  71.267385 44.037596 86.904633
H  78.450966 40.332781 80.807299
H  76.77062 40.581108 84.808653
C  71.71923 44.265138 85.939052
H  70.960538 44.092745 85.176549
C  72.195852 45.707299 85.896308
H  72.955459 45.889539 86.658558
H  72.619975 45.947206 84.921243
H  71.361803 46.384672 86.085686
O  72.76453 43.327717 85.66082
H  73.459618 43.416829 86.319551
C  78.405947 41.166009 80.106012
H  79.189998 41.86398 80.409591
C  78.699083 40.663033 78.695806
H  77.939875 39.951045 78.372583
H  78.715718 41.492661 77.987353
H  79.670821 40.165428 78.662761
O  77.18044 41.870717 80.206998
H  76.459141 41.212759 80.050556
C  75.683029 40.604061 84.876938
H  75.300569 39.654785 84.507415
C  75.28107 40.808111 86.327658
H  74.196676 40.798204 86.440539
H  75.696659 40.013902 86.949813
H  75.658039 41.761042 86.70325
O  75.187643 41.683054 84.08145
H  75.038041 41.375114 83.158774
K  72.441886 41.792947 83.542068
