program: Gaussian 09
title: 000075935
version: EM64L-G09RevD.01
frameworkgroup: C1[X(C14H10N6O6S2)]
method: RPBEPBE
basis: SDD
operation: Freq
keyword: #p
keyword: freq=noraman
keyword: PBEPBE/SDD
title: #p freq=noraman PBEPBE/SDD
converged: YES YES NO NO
title: Mulliken charges:
elementType: S S O O O O O O N N N N N N C C C C C C C C C C C C C C H H H H H H H H H H
charge: 0.949465 0.949908 -0.563756 -0.564290 -0.497977 -0.494367 -0.494463 -0.498145 -0.057003 -0.056972 0.000410 0.000341 -0.031397 -0.031405 0.596016 0.594844 -0.275063 -0.274406 -0.267447 -0.267598 -0.354764 -0.354882 -0.377075 -0.377021 0.287989 0.287877 -0.392259 -0.392117 0.250525 0.250076 0.265793 0.266289 0.310377 0.310342 0.266237 0.266241 0.384616 0.385060
chargesum: 0.00000
title: Mulliken charges with hydrogens summed into heavy atoms:
elementType: S S O O O O O O N N N N N N C C C C C C C C C C C C C C
charge: 0.949465 0.949908 -0.179139 -0.179230 -0.497977 -0.494367 -0.494463 -0.498145 -0.057003 -0.056972 0.000410 0.000341 -0.031397 -0.031405 0.596016 0.594844 -0.275063 -0.274406 -0.016922 -0.017522 -0.088971 -0.088593 -0.066698 -0.066679 0.287989 0.287877 -0.126022 -0.125876
polarizability: 6.94767098e+02 -3.79012023e+01 2.79575942e+02 3.42272852e+00 1.77076914e+00 1.33878206e+02
1716.lowfreq: -4.6118 -0.0012 -0.0005 0.0011 3.8459 4.8625 13.6774 21.7773 29.6110
frequency: 13.6621 21.7766 29.6109 36.5610 38.7682 41.0897 54.7122 83.7695 86.2585 88.5262 101.0234 111.3196 121.0320 137.9640 163.5472 173.6977 178.5402 186.4380 197.4508 208.7119 215.5723 227.0645 241.7649 248.6771 265.2491 292.4601 318.5601 319.8957 327.3538 337.9583 342.8502 366.8977 386.7641 413.1459 419.8918 420.7181 430.2025 449.0146 457.6885 457.9147 467.9719 511.1112 526.6590 534.1842 544.3930 588.7529 598.9537 614.6128 645.9453 659.2026 661.1370 713.8279 744.9046 765.7659 790.2131 828.4615 832.8818 840.0829 851.2606 853.2916 864.6540 887.6622 900.2132 900.2419 932.9427 958.3773 963.0327 985.3775 986.7351 1004.9926 1005.4397 1041.1234 1042.2120 1104.0359 1105.0426 1134.8435 1140.7855 1209.7562 1240.9488 1282.5738 1289.3546 1305.8454 1324.5293 1333.5851 1341.2473 1361.6172 1383.1424 1430.4659 1431.3278 1471.9954 1489.8069 1530.4285 1536.3015 1603.9800 1616.1470 1640.0975 2046.6911 2050.6790 3136.6486 3136.6888 3147.5826 3154.4063 3156.7004 3160.5512 3178.9289 3178.9936 3476.8348 3477.2167
redmass: 10.6826 8.8743 10.3846 10.9273 11.6053 8.6067 6.7087 10.3501 12.4564 11.0847 6.4511 5.5815 6.7697 8.6635 7.7335 3.3146 2.5067 1.9821 4.3703 2.4445 8.3021 4.2476 5.8009 6.9549 3.0311 4.3633 7.3068 8.7632 11.6502 6.9312 7.8762 8.0303 4.6857 9.5304 7.1666 10.0691 7.4247 3.5704 13.2594 11.9243 4.6012 8.8772 5.0023 9.8385 9.5088 5.4950 3.9929 9.2829 7.2559 8.0383 8.6802 3.2087 3.6655 8.0138 7.6118 11.3226 9.0702 1.4891 4.9050 1.6007 3.3200 2.8572 1.4620 1.4611 1.3445 12.9988 4.7765 1.4230 1.3851 2.9785 3.1014 1.2116 1.2105 4.4298 3.9874 1.4949 1.5974 1.8770 1.5048 1.7883 2.1488 1.7004 4.3230 5.1082 2.0015 1.9126 2.1939 4.7351 5.0485 3.1750 3.4572 6.5452 5.6342 6.4305 7.1982 4.8341 13.9824 13.9840 1.0925 1.0925 1.0944 1.0886 1.0887 1.0860 1.0970 1.0970 1.0662 1.0662
irintensity: 0.9853 0.8283 1.3110 0.0674 0.3348 0.0021 0.0001 0.5026 0.0010 0.5524 0.0010 0.7551 0.0001 0.0000 23.7308 0.0014 0.0132 52.5695 6.6647 0.0007 18.9961 0.0006 19.8974 0.0027 107.5493 0.0022 0.9136 49.3233 16.8671 0.0089 0.0029 38.0049 2.0600 14.8667 0.5298 97.7661 0.0003 0.0078 2.7025 0.0576 21.9695 0.0115 9.2619 3.9515 290.3723 0.0220 3.4546 46.7569 0.0005 11.5072 0.0016 0.0003 1.2731 27.2480 0.0010 90.9146 0.0141 0.0028 22.9190 62.9488 0.0006 0.0030 16.5800 36.4886 53.5829 0.0030 161.6981 0.0004 0.7764 0.1779 32.7866 52.9798 101.7616 0.0639 21.8219 15.2288 0.0008 0.0002 13.6083 0.0024 22.4957 34.5404 0.0021 276.3549 0.0016 0.0005 21.0003 79.2206 0.0256 0.0052 589.3241 0.0010 4.6725 0.0011 85.6224 0.0009 2002.7437 0.2960 4.6908 18.1570 0.0204 14.7872 0.0035 8.6002 3.7240 3.2709 45.9867 47.1532
temp: 298.150 k
press: 1.00000 atm
elementType: 16 16 8 8 8 8 8 8 7 7 7 7 7 7 6 6 6 6 6 6 6 6 6 6 6 6 6 6 1 1 1 1 1 1 1 1 1 1
symmnumber: 1
zpe: 614106.0 jmol-1
zpe.correction: 0.233901 hartree
zpe.thermalcorrener: 0.262354 hartree
zpe.thermalcorrenthalpy: 0.263298 hartree
zpe.thermalcorrgfe: 0.171503 hartree
zpe.sumelectzpe: -2112.988407 hartree
zpe.sumelectthermal: -2112.959954 hartree
zpe.sumelectthermalent: -2112.959010 hartree
zpe.sumelectthermalfe: -2113.050805 hartree
dipole: 0.0076 0.0152 -0.0343
dipole: 0.0383
quadrupole: -205.9736 -171.4176 -182.6599
quadrupole: -18.6609 -8.1673 -17.2532
quadrupole: -19.2899 15.2661 4.0238 -18.6609 -8.1673 -17.2532
hfenergy: -2113.2223081 hartree
pointgroup: C01 [X(C14H10N6O6S2)]
dipole: 0.0021598 -0.0049187 0.0140838 debye
polarizability: 696.4532425|-27.0256927|276.7591882|-4.9785395|-12.4420704|135.0088151 unknown
InChI: InChI=1S/C14H10N6O6S2/c15-19-17-11-5-3-9(13(7-11)27(21,22)23)1-2-10-4-6-12(18-20-16)8-14(10)28(24,25)26/h1-8,21,24H
charge 0 multiplicity 1
38 atoms
S  -2.710452 2.819657 -0.154069
S  2.626426 -2.816187 0.1202
O  -2.18423 2.82825 -1.941841
O  2.110944 -2.835331 1.907574
O  -4.110913 3.615041 -0.000651
O  -1.435479 3.280382 0.730636
O  1.346819 -3.271709 -0.760355
O  4.026128 -3.610584 -0.0454
N  -6.101471 -1.204943 0.155246
N  6.016702 1.21063 -0.176232
N  -7.088158 -0.406891 0.141471
N  7.003704 0.412804 -0.172204
N  -8.133266 0.150654 0.142478
N  8.048774 -0.14469 -0.18462
C  -1.9775 0.021766 -0.070173
C  1.893581 -0.017408 0.052734
C  -3.045085 0.958483 -0.082158
C  2.961151 -0.954152 0.057605
C  -0.567613 0.410756 -0.169335
C  0.483918 -0.406354 0.15189
C  -2.393288 -1.346532 0.01204
C  2.309062 1.351428 -0.021845
C  -4.406795 0.643757 -0.014507
C  4.322673 -0.639137 -0.011621
C  -4.761894 -0.725682 0.077497
C  4.67753 0.730809 -0.097005
C  -3.741688 -1.714355 0.085977
C  3.657319 1.719594 -0.096709
H  -0.368277 1.422293 -0.535987
H  0.283828 -1.418406 0.516472
H  -1.631375 -2.130909 -0.021617
H  1.547054 2.135388 0.018959
H  -5.155626 1.4445 -0.022517
H  5.071462 -1.439953 -0.010022
H  -4.033528 -2.767028 0.138387
H  3.949182 2.772534 -0.143382
H  -2.066228 3.783605 -2.219229
H  1.99491 -3.79178 2.181816
