program: Gaussian 16
title: Title
version: ES64L-G16RevC.02
basis: 6-311++G(2d,2p)
method: RB3LYP
operation: Freq
keyword: #p
keyword: freq
keyword: b3lyp/6-311++g(2d,2p)
keyword: nosymm
keyword: int=superfinegrid
keyword: scf=xqc
keyword: iop(7/90=-1)
title: #p freq b3lyp/6-311++g(2d,2p) nosymm int=superfinegrid scf=xqc iop(7/9
basis: NPDir=0 NMtPBC= 1 NCelOv= 1 NCel= 1 NClECP= 1 NCelD= 1
basis: NCelK= 1 NCelE2= 1 NClLst= 1 CellRange= 0.0.
basis: One-electron integrals computed using PRISM.
basis: NBasis= 1503 RedAO= T EigKep= 1.05D-05 NBF= 1503
basis: NBsUse= 1503 1.00D-06 EigRej= -1.00D+00 NBFU= 1503
converged: NO NO NO NO
title: Mulliken charges:
elementType: C H H C O O C H H C O O C H H C O O H O P O O O P O O O P O O O C H H Mg O H H O H H O H H H H H H H H H C H C H H H O H C H C H H H O H C H C H H H O H K
charge: -0.216453 0.064652 0.131676 0.395016 -0.486656 -0.550909 -0.434086 0.065930 0.063925 0.696772 -0.511676 -0.567579 -0.296063 0.044985 0.262345 0.377675 -0.578157 -0.711829 0.500933 -0.763418 0.908501 -0.708577 -0.544013 -0.469359 1.418823 -0.818059 -0.747653 -0.572225 1.263834 -0.757273 -0.696000 -0.516316 -0.019620 0.118415 0.078834 0.278041 -0.576565 0.305519 0.259290 -0.591725 0.211427 0.430590 -0.469526 0.337877 0.241743 0.079916 0.144044 0.095156 0.073914 0.075324 0.066141 0.085165 0.095938 0.078974 -0.321328 0.064104 0.131400 0.066277 -0.390154 0.242493 0.037568 0.036290 -0.249001 0.175163 0.045215 0.003178 -0.459632 0.305845 0.184028 0.063245 -0.375236 0.070913 0.079479 0.093419 -0.535967 0.351949 0.733113
chargesum: -3.00000
polarizability: 3.75854515e+02 1.53614396e+01 3.83917955e+02 1.52182149e+01 7.25771145e+00 3.95664299e+02
frequency: 22.2140 33.5873 38.3446 41.6525 43.0844 53.9256 63.6375 71.6920 73.7506 76.5631 78.0456 86.9396 92.0379 100.5013 104.7472 114.8149 119.0100 126.3248 128.7389 133.6635 142.7190 152.4526 158.8575 164.2287 166.7508 167.7230 169.1460 184.5305 190.9856 195.2658 195.9456 200.5100 209.3248 213.8935 217.9883 225.7054 241.1428 243.0597 260.7796 266.0693 268.1978 269.3737 286.5527 289.3280 295.6072 310.7071 324.5454 325.3233 339.2174 341.2474 346.0202 350.0340 364.5208 366.9182 378.3318 392.9417 407.2261 425.1467 447.2896 450.0960 459.6317 472.9079 499.7866 504.6960 509.4377 523.3065 531.9683 542.2841 551.1948 552.4417 555.7047 583.3506 601.2440 638.3767 648.5774 656.5275 660.2740 661.6957 666.5617 673.0624 715.6860 716.7887 720.1305 725.8563 736.4583 751.1378 753.1072 761.4132 770.2898 785.1890 827.6999 833.7714 846.7663 872.3083 895.7623 916.7849 928.8330 940.2601 949.3617 961.6435 964.6254 987.8769 1005.6551 1009.4261 1015.0978 1061.1967 1067.2767 1090.8834 1094.8489 1100.1544 1103.4564 1107.2340 1108.6248 1135.2849 1138.0605 1159.1074 1177.9591 1183.0920 1184.9091 1205.5868 1223.1160 1227.9128 1229.2861 1242.9466 1260.7879 1282.6858 1289.1628 1330.5759 1353.6338 1373.2180 1382.9363 1389.8980 1397.1420 1405.9249 1410.9937 1411.7669 1413.7419 1433.6413 1461.8329 1466.6758 1474.0536 1475.8446 1482.8162 1487.6684 1498.0155 1498.7320 1499.3462 1583.5794 1615.9367 1684.0727 1699.4543 1716.9656 1722.4988 2760.6468 2893.8801 2901.1864 2936.8935 2940.7490 2944.3278 2949.1477 2965.0729 2978.9021 2983.4826 2989.4203 2994.1835 3012.7463 3019.2867 3027.3668 3028.1268 3068.6183 3070.5371 3082.4417 3083.3747 3105.1363 3107.1853 3132.1583 3145.6964 3266.6332 3437.3061 3796.4950 3832.6284 3858.4546 3872.4633
redmass: 8.7380 15.3075 12.4414 13.0621 11.0152 12.9344 4.3355 8.8020 8.8618 5.9557 3.5563 4.6384 7.4698 8.9417 9.2093 5.6632 9.4938 8.5663 8.2173 8.4264 7.1295 9.0252 9.6212 3.9302 2.7412 7.8322 3.3782 3.7699 7.0858 1.1696 1.2233 10.3048 1.2870 6.3696 6.7698 11.1587 7.2738 1.0413 4.4528 9.6890 4.5269 4.8495 8.4175 7.1212 6.7620 10.1103 4.1439 3.9567 1.9429 3.9536 11.6236 4.3902 7.2897 14.2799 8.6622 13.8690 5.7937 6.4542 5.1829 4.8777 1.3365 11.1992 13.2406 1.0717 5.7018 13.2531 11.1635 1.5443 1.3743 3.5048 1.4483 11.8443 1.1855 1.1349 4.1150 10.2803 4.6147 1.2508 4.1832 16.1313 9.1802 5.1537 5.3487 5.6207 1.0877 2.9911 1.1723 2.9956 2.5733 4.2394 8.2162 7.5867 12.9028 1.0622 8.8098 1.2161 1.0579 7.9857 1.1784 1.2320 1.1798 9.1436 1.3171 1.3176 1.3060 9.7526 1.1511 15.1962 1.1561 1.0852 1.0814 2.1366 1.8059 10.8678 1.1723 1.1284 1.0850 1.1033 1.0618 1.0971 2.0557 1.1563 1.8026 3.1667 1.4082 2.7068 1.1031 1.0596 9.9957 1.0686 1.2455 1.2341 1.2638 1.3177 1.2326 2.0710 1.0250 1.4775 1.0605 1.0247 1.0693 1.0581 1.0456 1.0397 1.0435 1.0455 1.0486 9.2377 8.1651 1.0715 1.1127 2.1806 1.6789 1.0872 1.0778 1.0082 1.0085 1.0080 1.0081 1.0084 1.0082 1.0082 1.0081 1.0081 1.0080 1.0405 1.0342 1.0080 1.0362 1.0940 1.0998 1.1004 1.0995 1.1007 1.1015 1.0709 1.0754 1.0738 1.0644 1.0650 1.0665 1.0647 1.0652
irintensity: 5.6259 5.8641 16.3193 4.1399 2.2278 14.3307 4.3980 2.6591 0.8203 9.3817 1.9749 7.0126 7.8678 33.8458 12.6104 4.6449 9.2532 7.1224 10.8170 19.4014 18.5843 14.4448 5.8973 5.3256 0.6248 13.9935 9.2575 6.5176 9.7319 0.3470 0.6842 12.7642 8.5310 5.5833 7.5500 3.1104 1.0206 61.1855 4.8012 6.4013 8.3507 11.6173 3.1562 20.0755 7.7711 5.9954 6.9700 9.5807 43.9606 18.2287 5.9995 17.2437 5.7297 8.2176 21.8722 2.4271 34.0679 32.3048 36.8873 18.3117 135.3060 72.3225 14.5194 11.1785 90.5247 150.7750 44.2050 19.2522 12.8719 151.5102 16.9967 12.8564 151.8630 100.1924 27.5094 36.9016 26.8974 2.2449 14.3466 105.4887 74.3864 3.9121 23.6728 1.4977 0.2584 17.3519 36.3007 22.8616 27.2729 80.8953 21.8873 13.0667 837.8965 42.3143 11.1395 162.0974 67.2733 326.0540 2.5694 22.3601 5.8000 55.2452 1.3765 3.2956 5.7679 326.5040 32.1090 42.8473 73.9124 0.7198 14.2408 230.9917 392.6852 488.2103 97.8266 7.7164 79.2225 12.6209 5.1926 30.7382 123.1489 70.9450 100.9832 464.5077 183.5509 785.1014 36.7121 0.1851 188.8458 16.8084 7.1524 5.0623 77.2033 48.1122 4.7916 212.8542 7.9945 10.4135 32.7377 5.8531 28.1346 33.2465 3.9199 5.6954 1.6415 4.5710 4.8544 576.4021 690.5671 33.4986 135.3618 396.7397 165.6330 2564.6870 1365.9611 165.7556 29.5030 31.4651 43.6806 9.7991 11.0060 29.1926 73.5277 28.4156 8.9765 121.8734 90.3678 10.4351 29.1394 50.6086 46.8489 73.5555 24.2558 20.1975 17.2330 1396.8165 1580.1930 1653.1795 959.0542 200.4330 33.0254 42.1702 25.4975
temp: 298.150 k
press: 1.00000 atm
elementType: 6 1 1 6 8 8 6 1 1 6 8 8 6 1 1 6 8 8 1 8 15 8 8 8 15 8 8 8 15 8 8 8 6 1 1 12 8 1 1 8 1 1 8 1 1 1 1 1 1 1 1 1 6 1 6 1 1 1 8 1 6 1 6 1 1 1 8 1 6 1 6 1 1 1 8 1 19
symmnumber: 1
zpe: 1219969.8 jmol-1
zpe.correction: 0.464662 hartree
zpe.thermalcorrener: 0.507503 hartree
zpe.thermalcorrenthalpy: 0.508448 hartree
zpe.thermalcorrgfe: 0.389603 hartree
zpe.sumelectzpe: -3997.924595 hartree
zpe.sumelectthermal: -3997.881753 hartree
zpe.sumelectthermalent: -3997.880809 hartree
zpe.sumelectthermalfe: -3997.999654 hartree
dipole: -1522.0819 -1917.0209 -1789.1042
dipole: 3031.9295
quadrupole: -161170.4433 -255423.1975 -222533.5505
quadrupole: -202497.4720 -188912.3457 -237994.6368
quadrupole: 51871.9538 -42380.8004 -9491.1534 -202497.4720 -188912.3457 -237994.6368
hfenergy: -3998.3892567 hartree
pointgroup: C01 [X(C13H37K1Mg1O22P3)]
dipole: -2.2380841 -0.4936467 -7.9414827 debye
polarizability: 375.8545146|15.3614396|383.9179552|15.2182149|7.2577114|395.664299 unknown
InChI: InChI=1/C2H4O2.2C2H3O2.3C2H6O.CH3O10P3.K.Mg.3H2O/c3*1-2(3)4;3*1-2-3;1-9-13(5,6)11-14(7,8)10-12(2,3)4;;;;;/h3H,1H3;2*1H3;3*3H,2H2,1H3;1H3;;;3*1H2/q;;-1;;;;-5;+2;+4;;;/rC7H22KMgO16P3.C2H4O2.C2H3O2.C2H6O.H2O/c1-5-16-8(25(6-2)29-8)18-26(13)20-9(11,12,17-7(3)10)21-27(14,23-26)24-28(15-4,19-8)22-9;2*1-2(3)4;1-2-3;/h16H,5-6,11-12H2,1-4H3;3H,1H3;1H3;3H,2H2,1H3;1H2
charge -3 multiplicity 1
77 atoms
C  101.84743 129.46107 124.07799
H  101.08736 128.73056 124.35068
H  102.83141 129.11263 124.37502
C  101.49957 130.80092 124.69542
O  100.42158 131.34188 124.51672
O  102.4815 131.32585 125.41089
C  108.38298 134.1020 127.34475
H  107.8440 134.16498 128.2938
H  109.40046 134.44571 127.52295
C  107.68318 135.01864 126.34877
O  106.71208 134.55061 125.70025
O  108.09833 136.21337 126.26532
C  103.71411 134.85188 128.04186
H  103.31843 135.86904 127.99545
H  104.62859 134.81372 127.45311
C  102.66848 133.8737 127.50241
O  101.96425 133.24041 128.3049
O  102.58561 133.77345 126.22178
H  102.32077 132.28509 125.72124
O  104.95474 131.33359 121.82472
P  105.84566 131.96927 122.88998
O  105.25125 133.24704 123.46486
O  106.38036 130.97248 123.91036
O  107.24377 132.44114 122.05578
P  107.70378 133.92536 121.65997
O  107.6256 134.86016 122.84479
O  108.97662 133.83651 120.89227
O  106.51126 134.36293 120.59689
P  105.37103 135.52041 120.65971
O  105.11303 135.9502 122.07969
O  104.24473 135.04862 119.79699
O  106.08084 136.7602 119.88157
C  107.10001 137.51398 120.56599
H  107.77199 136.8644 121.12387
H  106.64238 138.23559 121.24284
Mg 105.8293 135.15903 123.86697
O  105.16471 130.30416 126.29574
H  104.26077 130.61128 126.1531
H  105.62437 130.57456 125.46926
O  103.95578 135.55785 124.78353
H  103.97253 136.34595 125.33243
H  103.48005 134.85523 125.3107
O  106.45718 137.1459 124.4724
H  107.14931 136.89427 125.16554
H  106.93632 137.5141 123.72441
H  103.91718 134.60729 129.06362
H  108.39352 133.07299 127.05173
H  107.64519 138.02272 119.79861
H  101.81572 129.59607 123.0170
H  100.79454 131.86918 116.62101
H  108.84394 128.85448 122.97356
H  107.4074 130.17684 119.17686
C  101.09904 131.37244 117.54225
H  100.76729 131.99979 118.36912
C  100.47949 129.98925 117.64548
H  100.8016 129.35419 116.81766
H  100.76254 129.50643 118.58052
H  99.39128 130.05995 117.60899
O  102.52732 131.35098 117.62327
H  102.87685 130.71118 116.9961
C  108.28897 128.15701 123.60098
H  108.5156 127.15011 123.24107
C  108.73665 128.30038 125.05223
H  108.52173 129.30305 125.42145
H  108.21399 127.58396 125.68789
H  109.81171 128.12396 125.14275
O  106.89258 128.34405 123.42883
H  106.68609 129.30157 123.56658
C  106.56104 130.81502 118.92298
H  106.76112 131.80159 119.34534
C  106.43327 130.9012 117.41088
H  107.3588 131.27808 116.97237
H  106.2296 129.91709 116.9840
H  105.62355 131.57369 117.12309
O  105.36508 130.2721 119.47588
H  105.33705 130.53033 120.43538
K  103.50785 132.37878 119.87991
