program: Gaussian 16
title: Title
version: ES64L-G16RevC.02
basis: 6-311++G(2d,2p)
method: RB3LYP
operation: Freq
keyword: #p
keyword: freq
keyword: b3lyp/6-311++g(2d,2p)
keyword: nosymm
keyword: int=superfinegrid
keyword: scf
keyword: scrf=(cpcm,solvent=water)
keyword: iop(7/90=-1)
title: #p freq b3lyp/6-311++g(2d,2p) nosymm int=superfinegrid scf scrf=(cpcm,
basis: NPDir=0 NMtPBC= 1 NCelOv= 1 NCel= 1 NClECP= 1 NCelD= 1
basis: NCelK= 1 NCelE2= 1 NClLst= 1 CellRange= 0.0.
basis: One-electron integrals computed using PRISM.
basis: NBasis= 1493 RedAO= T EigKep= 1.48D-05 NBF= 1493
basis: NBsUse= 1493 1.00D-06 EigRej= -1.00D+00 NBFU= 1493
converged: NO NO NO NO
title: Mulliken charges:
elementType: C H H C O O C H H C O O C H H C O O O P O O O P O O O P O O O C H H Mg O H H O H H O H H H H H H H H H C H C H H H O H C H C H H H O H C H C H H H O H K
charge: -0.183613 0.099078 0.079030 0.442589 -0.715127 -0.771880 -0.393442 0.113207 0.102712 0.826772 -0.685783 -0.633729 -0.228582 0.111885 0.117203 0.388684 -0.662137 -0.731025 -0.838112 1.140390 -0.858485 -0.613851 -0.474867 1.427532 -0.863054 -0.795578 -0.594345 1.325172 -0.848925 -0.707744 -0.537226 -0.011174 0.082708 0.117784 0.323138 -0.649478 0.361208 0.218926 -0.649222 0.347010 0.423728 -0.538227 0.349709 0.287113 0.119521 0.110294 0.155701 0.107713 0.098503 0.074856 0.109865 0.129806 0.068950 -0.336288 0.094796 0.092524 0.091685 -0.465846 0.278000 0.086080 0.086843 -0.329964 0.112936 0.089765 0.074576 -0.545952 0.334121 0.154475 0.037854 -0.385073 0.091939 0.103250 0.096051 -0.544902 0.339748 0.768200
chargesum: -4.00000
polarizability: 4.98857822e+02 1.55765471e+01 4.78414830e+02 3.05696632e+00 8.82933205e+00 4.90147655e+02
frequency: 41.2787 50.4752 53.1234 57.5563 65.0266 73.9332 77.5127 84.4976 91.0277 94.1660 95.7146 99.5228 99.9722 105.2868 113.8827 118.6343 130.0111 134.3999 139.0981 144.6832 154.8998 163.8607 164.7120 172.8376 176.8298 177.9210 180.8676 182.8815 192.5086 201.8121 209.7327 222.8047 225.3675 243.2362 250.3453 254.8980 262.8876 269.2133 278.9956 293.8524 301.8933 302.9922 320.0350 327.1587 328.9627 329.7087 334.3746 336.6757 342.9312 346.6158 353.4398 358.0332 362.1709 394.2523 411.1430 415.4343 417.4817 424.3278 453.6307 469.1499 493.4481 501.6267 510.8278 521.1592 532.2497 538.2980 567.2765 577.6734 583.6716 602.0727 623.6232 635.1699 642.6178 650.3714 652.8074 658.6131 667.1290 667.4764 687.0836 715.8645 726.5527 729.6857 740.6048 759.1489 764.1513 767.2398 770.7345 790.9186 793.3830 812.4369 815.2562 816.5631 851.7414 852.9898 880.2981 899.2081 933.5396 942.8248 951.1648 976.7606 980.7544 983.2962 1007.4534 1025.5191 1028.6619 1035.2586 1036.8686 1055.1347 1078.4885 1086.3948 1115.9238 1133.5918 1139.8588 1164.4470 1165.8678 1176.5935 1183.4791 1195.5152 1210.7852 1213.0960 1228.7597 1234.9942 1258.4455 1259.3933 1312.7635 1318.2286 1326.7043 1349.9942 1383.3950 1399.0616 1402.7399 1411.1476 1414.2070 1417.4245 1417.6024 1421.9885 1474.6248 1478.7286 1485.1362 1486.5805 1489.1348 1493.1959 1494.5680 1496.5603 1499.1717 1530.2798 1533.6922 1563.0363 1675.8658 1705.2257 1729.9679 2865.3017 2881.3141 2887.9890 2897.5850 2898.9945 2909.3564 2914.0305 2934.6195 2942.1437 2946.0053 2949.0224 2961.9892 2974.5070 2977.9172 2983.2526 2999.1377 3030.4489 3032.0196 3038.8165 3039.2148 3046.8316 3054.9024 3055.8796 3151.1445 3286.2821 3605.4450 3660.5535 3672.4854 3724.8868
redmass: 9.2383 9.5866 17.6361 16.6545 10.8097 12.4857 10.6218 5.0687 12.3924 3.6364 7.1820 10.0009 12.0695 11.4348 10.4139 10.9842 9.0841 7.5669 9.9082 7.9889 7.9366 7.7817 9.3806 6.7396 7.1957 2.8844 7.9487 2.9363 7.6898 3.7637 6.3572 12.0734 10.2887 8.8754 3.6253 5.1951 11.5891 10.8919 5.0853 13.1134 9.6303 7.1198 1.6399 1.2206 1.2588 1.1828 3.5645 12.9692 13.4838 15.6886 11.3232 4.2099 14.3173 14.7663 9.0978 12.7082 1.2192 8.2086 7.5325 17.1799 16.6198 15.8073 15.2930 15.7610 1.1637 15.7701 1.8922 2.2379 1.1726 1.2267 1.2866 17.3455 12.0067 3.8354 1.0401 4.3453 4.0613 1.3350 15.0897 4.8538 5.7563 5.9797 1.1450 1.2290 1.1185 2.7044 2.3948 12.0516 2.1019 8.3451 10.2205 7.2618 1.0904 8.6979 11.6318 1.0634 1.4877 1.1083 3.5276 1.1682 1.1667 1.1942 14.9742 1.3024 1.2910 1.8834 3.2225 7.0290 1.1346 15.8064 1.0834 1.0713 1.0513 19.2697 1.0645 1.0966 15.3323 1.1041 1.0599 1.0569 1.0607 1.0506 1.1274 1.0452 10.8339 1.0821 1.0570 12.3380 4.6340 1.0649 1.2304 1.1836 1.2337 1.0309 1.2292 1.0471 1.0251 1.0424 1.0443 1.0416 1.0804 1.0448 1.0663 1.0521 1.0445 8.4548 7.5034 7.3108 1.0784 1.0798 1.1051 1.0081 1.0081 1.0083 1.0080 1.0081 1.0079 1.0081 1.0236 1.0531 1.0091 1.0081 1.0080 1.0359 1.0347 1.0369 1.0720 1.1002 1.1020 1.0990 1.1007 1.1015 1.1021 1.0732 1.0726 1.0671 1.0688 1.0632 1.0630 1.0663
irintensity: 29.8320 3.8495 20.4112 24.1266 26.6176 18.1056 49.1480 17.0380 1.9163 1.6598 35.5570 6.7290 21.5972 34.8082 4.1144 20.8411 8.4993 16.2535 12.3994 4.0761 9.9656 27.4051 21.4552 25.2090 34.0001 1.2832 32.5289 5.1802 8.0475 6.0847 4.8386 9.5667 3.1500 8.5808 3.4154 11.0080 1.9561 20.4617 14.0491 13.6310 8.7311 14.4023 3.5755 3.8267 1.6449 1.9447 6.7084 4.4759 27.3591 9.3176 30.2361 33.1377 26.8320 6.4713 0.1955 75.3176 175.3279 2.7732 4.0777 310.5525 126.0599 326.6296 30.7699 127.6344 49.2602 258.5240 138.6568 10.5152 170.4874 31.4955 10.1076 217.4806 151.6188 26.6629 228.4694 38.6908 15.1427 2.7898 135.2365 25.0278 17.0714 41.2944 289.2076 222.2153 6.9224 16.6015 105.8920 1011.0055 32.3422 41.0454 118.4033 182.5419 157.8055 18.2296 764.5334 160.5307 385.1505 310.2702 42.6563 5.0693 3.0044 40.4062 388.6810 3.0425 5.4113 41.2875 132.2275 674.4839 216.6902 808.8122 14.0168 16.2445 4.3149 460.2221 36.1747 41.5109 863.7991 17.8359 37.8935 7.2717 2.3610 10.9533 88.5559 22.0773 425.2308 19.7855 2.3824 350.8648 373.8567 32.3848 9.6983 67.0853 9.1145 45.7494 6.0575 132.4841 11.7676 18.9570 13.2629 11.7440 78.8736 8.3189 66.0977 3.1675 0.0887 1281.6341 1089.8704 1109.0692 67.5288 142.7903 171.0571 115.3440 14.4644 23.4990 31.4388 23.7452 25.5043 35.6568 316.4740 1500.3164 25.2654 36.3289 22.5271 42.8959 70.0739 24.1016 1772.8259 54.6399 49.1778 43.7072 115.7597 43.0747 42.4292 1721.0204 1793.6744 1224.3697 502.5078 221.1853 200.3943 61.7688
temp: 298.150 k
press: 1.00000 atm
elementType: 6 1 1 6 8 8 6 1 1 6 8 8 6 1 1 6 8 8 8 15 8 8 8 15 8 8 8 15 8 8 8 6 1 1 12 8 1 1 8 1 1 8 1 1 1 1 1 1 1 1 1 6 1 6 1 1 1 8 1 6 1 6 1 1 1 8 1 6 1 6 1 1 1 8 1 19
symmnumber: 1
zpe: 1185000.6 jmol-1
zpe.correction: 0.451343 hartree
zpe.thermalcorrener: 0.492377 hartree
zpe.thermalcorrenthalpy: 0.493321 hartree
zpe.thermalcorrgfe: 0.380795 hartree
zpe.sumelectzpe: -3997.953951 hartree
zpe.sumelectthermal: -3997.912917 hartree
zpe.sumelectthermalent: -3997.911973 hartree
zpe.sumelectthermalfe: -3998.024499 hartree
dipole: -2001.8042 -2548.8607 -2392.0294
dipole: 4028.1156
quadrupole: -209069.3365 -338597.2835 -298183.2707
quadrupole: -265637.0668 -249111.7385 -317325.7096
quadrupole: 72880.6271 -56647.3199 -16233.3072 -265637.0668 -249111.7385 -317325.7096
hfenergy: -3998.4052941 hartree
pointgroup: C01 [X(C13H36K1Mg1O22P3)]
dipole: 6.657512 2.1290326 -13.2044593 debye
polarizability: 498.8578223|15.5765471|478.4148295|3.0569663|8.829332|490.1476553 unknown
InChI: InChI=1/3C2H3O2.3C2H6O.CH3O10P3.K.Mg.3H2O/c3*1-2(3)4;3*1-2-3;1-9-13(5,6)11-14(7,8)10-12(2,3)4;;;;;/h3*1H3;3*3H,2H2,1H3;1H3;;;3*1H2/q;;-1;;;;-5;+2;+4;;;/rC7H22KMgO16P3.2C2H3O2.C2H6O.H2O/c1-5-16-8(25(6-2)29-8)18-26(13)20-9(11,12,17-7(3)10)21-27(14,23-26)24-28(15-4,19-8)22-9;2*1-2(3)4;1-2-3;/h16H,5-6,11-12H2,1-4H3;2*1H3;3H,2H2,1H3;1H2
charge -4 multiplicity 1
76 atoms
C  101.84714 129.46115 124.07803
H  102.40416 128.53281 124.26432
H  102.37872 130.28945 124.55191
C  100.3985 129.31252 124.60968
O  99.67687 128.44933 124.04577
O  100.04722 130.06582 125.57135
C  108.3831 134.10208 127.34489
H  107.78974 134.15779 128.26793
H  109.40165 134.42237 127.58314
C  107.75895 135.05168 126.32336
O  106.67064 134.68145 125.77729
O  108.33242 136.15836 126.13339
C  103.71387 134.85175 128.04193
H  104.02385 135.8987 127.90618
H  104.36841 134.23757 127.41554
C  102.24725 134.72219 127.58806
O  101.34142 134.76473 128.4417
O  102.08868 134.62396 126.3152
O  104.98924 131.37592 121.80228
P  105.90769 131.94969 122.89959
O  105.3254 133.23405 123.51881
O  106.4560 130.92403 123.88419
O  107.31375 132.45892 122.04559
P  107.7458 133.94826 121.61536
O  107.65901 134.90792 122.80545
O  109.01652 133.89153 120.82515
O  106.50984 134.36959 120.57153
P  105.33783 135.51204 120.6528
O  105.04429 135.90156 122.09274
O  104.22116 135.04372 119.75724
O  106.0509 136.78937 119.90075
C  107.09995 137.5141 120.56598
H  107.77912 136.84118 121.09729
H  106.68014 138.23477 121.27632
Mg 105.82941 135.15894 123.86688
O  102.05719 131.64983 126.68185
H  101.31482 131.1409 126.26767
H  101.96615 132.56301 126.34981
O  104.22186 135.7637 125.11738
H  104.81185 135.70681 125.88981
H  103.4038 135.25527 125.43068
O  106.82667 137.11097 124.15614
H  107.40408 136.86602 124.94443
H  107.39302 136.87192 123.39949
H  103.91738 134.6073 129.0636
H  108.39341 133.07304 127.05168
H  107.64529 138.02262 119.79861
H  101.81596 129.59603 123.01701
H  100.7945 131.86947 116.62119
H  108.84397 128.85448 122.97359
H  107.40738 130.17683 119.17688
C  101.0990 131.37197 117.54201
H  100.74235 131.98922 118.37339
C  100.50648 129.97179 117.63377
H  100.85467 129.34231 116.80453
H  100.79357 129.49199 118.57546
H  99.41217 130.01463 117.58602
O  102.5244 131.37951 117.64269
H  102.8880 130.73307 117.01821
C  108.2889 128.15703 123.60089
H  108.56502 127.14271 123.27783
C  108.69279 128.36685 125.06261
H  108.41686 129.37881 125.37857
H  108.17116 127.65262 125.71108
H  109.77502 128.24051 125.20386
O  106.89614 128.29352 123.39962
H  106.67542 129.25596 123.55008
C  106.56102 130.81501 118.9230
H  106.76649 131.80983 119.33907
C  106.4356 130.89797 117.4060
H  107.36569 131.2710 116.96029
H  106.2238 129.90853 116.98114
H  105.62194 131.57468 117.11667
O  105.36225 130.27957 119.47087
H  105.35353 130.5312 120.44288
K  103.50803 132.37897 119.88002
