program: Gaussian 16
title: Title Card Required
version: ES64L-G16RevC.02
method: RB3LYP
basis: 6-311++G(2d,2p)
operation: Freq
keyword: #P
keyword: Geom=AllCheck
keyword: Guess=TCheck
keyword: SCRF=Check
keyword: GenChk
keyword: RB3LYP/6-311++G(2d,2p)
keyword: Freq
converged: YES YES YES YES
title: Mulliken charges:
elementType: O H H
charge: -0.468412 0.234206 0.234206
chargesum: 0.00000
title: Mulliken charges with hydrogens summed into heavy atoms:
elementType: O
charge: 0.000000
polarizability: 8.66379282e+00 -4.41629518e-01 8.35101411e+00 1.16314313e-15 -5.84817419e-15 8.05229617e+00
1716.lowfreq: -4.9837 -3.4617 -1.7021 0.0009 0.0009 0.0012 1639.4680 3821.3193 3923.0972
frequency: 1639.4680 3821.3193 3923.0972
redmass: 1.0836 1.0443 1.0825
irintensity: 71.1047 7.4785 61.7420
temp: 298.150 k
press: 1.00000 atm
elementType: 8 1 1
symmnumber: 2
zpe: 56128.1 jmol-1
zpe.correction: 0.021378 hartree
zpe.thermalcorrener: 0.024213 hartree
zpe.thermalcorrenthalpy: 0.025158 hartree
zpe.thermalcorrgfe: 0.003739 hartree
zpe.sumelectzpe: -76.440663 hartree
zpe.sumelectthermal: -76.437827 hartree
zpe.sumelectthermalent: -76.436883 hartree
zpe.sumelectthermalfe: -76.458301 hartree
dipole: 1.1311 1.6004 0.0000
dipole: 1.9598
quadrupole: -7.7463 -3.3230 -7.8029
quadrupole: -1.9564 -0.0000 0.0000
quadrupole: -1.4556 2.9678 -1.5122 -1.9564 -0.0000 0.0000
hfenergy: -76.4620407 hartree
pointgroup: C02V [C2(O1),SGV(H2)]
dipole: 0.4449946 0.6296528 0. debye
dipolederiv: -0.4623756 0.0704651 0. 0.0704652 -0.4124696 0. 0. 0. -0.698606 0.1693051 -0.0514422 0. -0.0628506 0.2681176 0. 0. 0. 0.3493031 0.2930706 -0.0190229 0. -0.0076146 0.144352 0. 0. 0. 0.3493028 unknown
polarizability: 8.6637928|-0.4416295|8.3510141|0.|0.|8.0522962 unknown
InChI: InChI=1/H2O/h1H2
charge 0 multiplicity 1
3 atoms
O  -1.23051932 0.67947356 0.0000
H  -0.27036013 0.71606647 0.0000
H  -1.51653305 1.59677441 0.0000
