program: Gaussian 16
title: Title Card Required
version: ES64L-G16RevC.02
method: RB3LYP
basis: 6-311++G(2d,2p)
operation: Freq
keyword: #P
keyword: Geom=AllCheck
keyword: Guess=TCheck
keyword: SCRF=Check
keyword: GenChk
keyword: RB3LYP/6-311++G(2d,2p)
keyword: Freq
converged: YES YES YES YES
title: Mulliken charges:
elementType: O H H
charge: -0.532452 0.266230 0.266222
chargesum: -0.00000
title: Mulliken charges with hydrogens summed into heavy atoms:
elementType: O
charge: -0.000000
chargesum: 0.00000
polarizability: 9.34538355e+00 -4.28084652e-01 9.04253763e+00 3.83879894e-15 1.43143571e-15 9.03965793e+00
1716.lowfreq: -37.9560 -0.0009 -0.0009 -0.0008 42.4675 79.9911 1632.1280 3810.7239 3903.5475
frequency: 1632.1277 3810.7233 3903.5473
redmass: 1.0829 1.0449 1.0821
irintensity: 91.3965 17.8091 93.3456
temp: 298.150 k
press: 1.00000 atm
elementType: 8 1 1
symmnumber: 1
zpe: 55903.9 jmol-1
zpe.correction: 0.021293 hartree
zpe.thermalcorrener: 0.024128 hartree
zpe.thermalcorrenthalpy: 0.025072 hartree
zpe.thermalcorrgfe: 0.002995 hartree
zpe.sumelectzpe: -76.445961 hartree
zpe.sumelectthermal: -76.443126 hartree
zpe.sumelectthermalent: -76.442181 hartree
zpe.sumelectthermalfe: -76.464259 hartree
dipole: 1.2542 1.7745 -0.0000
dipole: 2.1730
quadrupole: -7.9848 -3.0211 -7.8531
quadrupole: -2.0859 0.0000 -0.0000
quadrupole: -1.6984 3.2652 -1.5668 -2.0859 0.0000 -0.0000
hfenergy: -76.4672537 hartree
pointgroup: CS [SG(H2O1)]
dipole: 0.4934213 0.698152 0. debye
dipolederiv: -0.5466314 0.0765933 0. 0.0765723 -0.492553 0. 0. 0. -0.7703012 0.2197117 -0.0489155 0. -0.0656344 0.2998094 0. 0. 0. 0.385226 0.3269196 -0.0276778 0. -0.0109379 0.1927436 0. 0. 0. 0.3850752 unknown
polarizability: 9.3453836|-0.4280847|9.0425376|0.|0.|9.0396579 unknown
InChI: InChI=1/H2O/h1H2
charge 0 multiplicity 1
3 atoms
O  -1.23168832 0.67781864 0.0000
H  -0.27050063 0.71740619 0.0000
H  -1.51522355 1.59708961 0.0000
