program: Gaussian 16
title: Title Card Required
version: ES64L-G16RevC.02
method: RB3LYP
basis: 6-311++G(2d,2p)
operation: Freq
keyword: #P
keyword: Geom=AllCheck
keyword: Guess=TCheck
keyword: SCRF=Check
keyword: GenChk
keyword: RB3LYP/6-311++G(2d,2p)
keyword: Freq
converged: YES YES YES YES
title: Mulliken charges:
elementType: O H H H
charge: -0.126145 0.375382 0.375382 0.375382
chargesum: 1.00000
title: Mulliken charges with hydrogens summed into heavy atoms:
elementType: O
charge: 1.000000
polarizability: 6.71865444e+00 -1.15795541e-06 6.71865466e+00 5.49559488e-04 7.76541393e-04 5.36991055e+00
1716.lowfreq: -2.5622 -1.9669 0.0008 0.0010 0.0012 0.9268 853.2242 1689.4652 1689.4657
frequency: 853.2242 1689.4652 1689.4657 3578.7979 3666.8700 3666.8729
redmass: 1.1706 1.0670 1.0670 1.0179 1.0889 1.0889
irintensity: 454.9426 105.4121 105.4122 34.2214 468.6320 468.6316
temp: 298.150 k
press: 1.00000 atm
elementType: 8 1 1 1
symmnumber: 1
zpe: 90585.4 jmol-1
zpe.correction: 0.034502 hartree
zpe.thermalcorrener: 0.037404 hartree
zpe.thermalcorrenthalpy: 0.038348 hartree
zpe.thermalcorrgfe: 0.015367 hartree
zpe.sumelectzpe: -76.699462 hartree
zpe.sumelectthermal: -76.696561 hartree
zpe.sumelectthermalent: -76.695617 hartree
zpe.sumelectthermalfe: -76.718597 hartree
dipole: -5.8557 3.3410 0.8293
dipole: 6.7926
quadrupole: 4.6280 -0.1870 -6.5810
quadrupole: -4.0732 -1.0093 0.5792
quadrupole: 5.3413 0.5264 -5.8676 -4.0732 -1.0093 0.5792
hfenergy: -76.7339642 hartree
pointgroup: C01 [X(H3O1)]
dipole: -0.0002342 -0.0003313 0.5764037 debye
dipolederiv: -0.4158 0. -0.0000514 0.0000001 -0.4157999 -0.0000733 -0.0000517 -0.0000732 -0.2885126 0.5881133 -0.0215347 0.0026551 -0.0215384 0.3557494 -0.0002903 0.008542 -0.0008312 0.4295082 0.3951944 -0.0898545 -0.0011601 -0.0898509 0.5486683 0.0024063 -0.0036349 0.0077745 0.429508 0.4324922 0.1113892 -0.0014436 0.1113892 0.5113822 -0.0020427 -0.0048554 -0.0068701 0.4294964 unknown
polarizability: 6.7186544|-0.0000012|6.7186547|0.0005496|0.0007765|5.3699106 unknown
InChI: InChI=1/H3O/h1H3
charge 1 multiplicity 1
4 atoms
O  -1.21897719 0.69580526 -0.20801477
H  -0.28352001 0.60967888 0.06966888
H  -1.61242555 1.54885644 0.06966887
H  -1.76132414 -0.07159788 0.06867702
