program: Gaussian 16
title: Title Card Required
version: ES64L-G16RevC.02
method: RB3LYP
basis: 6-311++G(2d,2p)
operation: Freq
keyword: #P
keyword: Geom=AllCheck
keyword: Guess=TCheck
keyword: SCRF=Check
keyword: GenChk
keyword: RB3LYP/6-311++G(2d,2p)
keyword: Freq
converged: YES YES YES YES
title: Mulliken charges:
elementType: O H H H
charge: -0.140196 0.380094 0.380000 0.380102
chargesum: 1.00000
title: Mulliken charges with hydrogens summed into heavy atoms:
elementType: O
charge: 1.000000
polarizability: 7.20643562e+00 8.08669203e-04 7.20421075e+00 1.25464724e-02 1.75873466e-02 5.88183521e+00
1716.lowfreq: -145.7071 -97.7709 -0.0011 0.0008 0.0012 98.0381 952.0359 1700.6412 1703.6319
frequency: 952.0008 1700.6399 1703.6225 3608.1052 3685.3941 3685.8713
redmass: 1.1674 1.0647 1.0644 1.0204 1.0867 1.0863
irintensity: 474.4081 112.7037 111.8787 47.5739 474.4704 474.9430
temp: 298.150 k
press: 1.00000 atm
elementType: 8 1 1 1
symmnumber: 1
zpe: 91727.5 jmol-1
zpe.correction: 0.034937 hartree
zpe.thermalcorrener: 0.037818 hartree
zpe.thermalcorrenthalpy: 0.038762 hartree
zpe.thermalcorrgfe: 0.015812 hartree
zpe.sumelectzpe: -76.793037 hartree
zpe.sumelectthermal: -76.790156 hartree
zpe.sumelectthermalent: -76.789211 hartree
zpe.sumelectthermalfe: -76.812162 hartree
dipole: -5.8655 3.3285 0.9979
dipole: 6.8175
quadrupole: 4.5590 -0.3013 -6.5904
quadrupole: -4.0639 -1.1781 0.7468
quadrupole: 5.3365 0.4762 -5.8128 -4.0639 -1.1781 0.7468
hfenergy: -76.8279737 hartree
pointgroup: C01 [X(H3O1)]
dipole: -0.0068194 -0.0086274 0.6697216 debye
dipolederiv: -0.456366 0.0010546 -0.0011594 0.000031 -0.4560235 -0.0012921 -0.001482 -0.0016833 -0.3252739 0.5974835 -0.0219597 0.007337 -0.020392 0.3738481 -0.0015529 0.0079699 -0.0016289 0.4419645 0.4114417 -0.0872037 -0.0038159 -0.0871697 0.5586447 0.0061352 -0.0043747 0.0066853 0.4415433 0.4474408 0.1081089 -0.0023617 0.1075307 0.5235307 -0.0032902 -0.0021132 -0.0033731 0.4417661 unknown
polarizability: 7.2064356|0.0008087|7.2042108|0.0125465|0.0175873|5.8818352 unknown
InChI: InChI=1/H3O/h1H3
charge 1 multiplicity 1
4 atoms
O  -1.21668103 0.69861008 -0.23044965
H  -0.29536181 0.60964075 0.08459367
H  -1.60825775 1.5374701 0.08417718
H  -1.75594628 -0.06297822 0.06167881
