program: Gaussian 09
title: 000075712
version: EM64L-G09RevD.01
frameworkgroup: C1[X(C10H16O3)]
method: RPBEPBE
basis: SDD
operation: Freq
keyword: #pfreq=noraman
keyword: PBEPBE/SDD
title: #p freq=noraman PBEPBE/SDD
converged: YES YES NO NO
title: Mulliken charges:
elementType: O O O C C C C C C C C C C H H H H H H H H H H H H H H H H
charge: -0.312221 -0.166847 -0.166185 -0.378423 -0.396319 -0.387444 -0.392117 -0.407266 -0.352984 -0.510529 -0.518501 0.273480 0.257540 0.201987 0.203931 0.196586 0.196618 0.208664 0.209261 0.200157 0.208995 0.212763 0.228219 0.208466 0.215165 0.237016 0.236789 0.245442 0.247757
chargesum: 0.00000
title: Mulliken charges with hydrogens summed into heavy atoms:
elementType: O O O C C C C C C C C C C
charge: -0.312221 -0.166847 -0.166185 0.027495 -0.003114 0.030481 0.017035 0.033716 0.070647 -0.036725 -0.025302 0.273480 0.257540
polarizability: 1.29332758e+02 -4.54833804e+00 1.18292325e+02 2.33959309e+00 4.85885962e+00 9.12123109e+01
1716.lowfreq: -4.5230 -0.0009 -0.0007 -0.0004 4.7235 15.3599 32.3757 55.4214 122.8927
frequency: 31.8927 55.1770 122.8917 127.4823 152.0405 175.3292 209.4629 241.0316 266.8699 277.7343 289.4481 343.1177 347.5146 403.6581 452.4658 484.9384 525.2302 561.3086 588.1805 693.0482 700.9822 732.1609 759.4316 778.6346 802.9305 831.7809 854.6676 881.8108 925.4063 942.2805 985.0015 989.8667 1020.8361 1036.9032 1075.3332 1087.8902 1094.6175 1104.7284 1124.4337 1157.0146 1164.9569 1194.6299 1205.3907 1230.9115 1263.3809 1280.3738 1293.1676 1302.6469 1316.9542 1327.5633 1334.1219 1340.6797 1345.9224 1360.5676 1369.2913 1436.0586 1458.5299 1460.9558 1465.2904 1466.2268 1473.9974 1481.2319 1491.4099 1646.4682 1714.7894 2963.7282 2974.4189 2978.8381 2981.7510 2986.3277 2987.5014 2998.2650 3013.7343 3020.6999 3027.2411 3031.6223 3044.8733 3046.4829 3051.0381 3069.6212 3102.2428
redmass: 7.7767 5.4252 4.2866 3.7013 2.8383 4.4998 3.6856 2.1184 2.0632 2.4359 2.7044 2.5609 2.3111 2.3685 3.8636 3.1620 4.1034 2.5146 4.4380 2.9067 1.4213 3.8857 1.6931 2.0978 2.2451 2.6745 2.3680 2.5574 1.9982 2.2798 2.0469 1.7963 2.2313 2.3090 2.1708 2.6792 2.4293 1.7539 2.7443 1.4636 1.3361 1.3283 1.3459 1.2965 1.2768 1.1864 1.3251 1.2180 1.2770 1.3328 1.1955 1.3675 1.3866 1.4723 1.4280 1.0759 1.0829 1.0722 1.1018 1.0841 1.0940 1.0747 1.0890 11.9071 11.5576 1.0603 1.0605 1.0626 1.0634 1.0624 1.0628 1.0677 1.0967 1.0955 1.0635 1.0961 1.1003 1.0976 1.1030 1.0980 1.1014
irintensity: 0.3487 2.9065 0.9160 1.5882 0.1583 1.6889 0.4776 0.6467 1.0587 2.1775 0.1218 0.3254 1.0435 1.9711 4.5658 3.5422 16.2836 0.6037 3.7176 4.2711 4.6068 11.7219 18.6516 11.0063 6.8407 73.5031 119.9240 1.8326 55.2879 239.3655 137.9872 32.0068 146.7935 23.9053 2.9111 7.4876 61.2952 0.3816 28.6149 27.0837 4.8710 8.1618 8.9486 1.5705 9.3509 2.4496 3.7931 0.7503 6.0315 7.9228 0.3401 7.2053 0.6669 0.1067 0.9593 15.3446 10.1386 2.1024 17.1435 13.7354 0.6331 5.3308 31.6305 76.7184 314.2862 31.6189 11.3760 62.4076 17.6678 8.5037 27.4884 28.3832 19.0148 25.6409 25.9160 57.0132 80.3557 12.6993 53.5811 47.5716 18.7167
temp: 298.150 k
press: 1.00000 atm
elementType: 8 8 8 6 6 6 6 6 6 6 6 6 6 1 1 1 1 1 1 1 1 1 1 1 1 1 1 1 1
symmnumber: 1
zpe: 645621.2 jmol-1
zpe.correction: 0.245904 hartree
zpe.thermalcorrener: 0.258920 hartree
zpe.thermalcorrenthalpy: 0.259864 hartree
zpe.thermalcorrgfe: 0.206319 hartree
zpe.sumelectzpe: -615.308947 hartree
zpe.sumelectthermal: -615.295931 hartree
zpe.sumelectthermalent: -615.294987 hartree
zpe.sumelectthermalfe: -615.348532 hartree
dipole: 2.0391 3.8520 2.3163
dipole: 4.9357
quadrupole: -75.7869 -85.7278 -78.9647
quadrupole: -9.2041 -2.1374 -6.5383
quadrupole: 4.3729 -5.5680 1.1951 -9.2041 -2.1374 -6.5383
hfenergy: -615.5548509 hartree
pointgroup: C01 [X(C10H16O3)]
dipole: 1.5296824 0.7655633 -0.9191012 debye
polarizability: 117.6584052|-3.8640678|129.823662|-5.7067206|-0.6271662|91.3553266 unknown
InChI: InChI=1S/C10H16O3/c11-9-7-5-3-1-2-4-6-8-10(12)13-9/h1-8H2
charge 0 multiplicity 1
29 atoms
O  -0.819612 -0.595364 -0.566494
O  -2.443798 0.254183 0.942343
O  -1.684951 -2.551035 0.444044
C  1.714789 1.67569 -0.315376
C  2.740514 0.677416 0.288132
C  0.646571 2.151018 0.703204
C  2.141603 -0.718304 0.611379
C  -0.650309 2.725278 0.079198
C  1.774498 -1.545724 -0.650627
C  -1.461223 1.712276 -0.793741
C  0.627283 -2.554028 -0.417978
C  -1.70265 0.420125 -0.034877
C  -0.738815 -1.956011 -0.087539
H  1.219964 1.196572 -1.18108
H  2.252875 2.55777 -0.716606
H  3.168492 1.1135 1.213919
H  3.587083 0.551212 -0.417534
H  1.090238 2.925002 1.360909
H  0.370564 1.314072 1.374909
H  1.240296 -0.58567 1.241239
H  2.859323 -1.291645 1.230912
H  -0.412762 3.598316 -0.5597
H  -1.308857 3.086085 0.89187
H  2.664184 -2.105674 -0.999575
H  1.484272 -0.869451 -1.473333
H  -0.93495 1.491438 -1.735252
H  -2.442647 2.159575 -1.034251
H  0.863239 -3.256366 0.403525
H  0.481187 -3.181559 -1.321422
