program: Gaussian 09
title: 000075702
version: EM64L-G09RevD.01
frameworkgroup: C1[X(C14H12O2)]
method: RPBEPBE
basis: SDD
operation: Freq
keyword: #pfreq=noraman
keyword: PBEPBE/SDD
title: #p freq=noraman PBEPBE/SDD
converged: YES YES NO NO
title: Mulliken charges:
elementType: O O C C C C C C C C C C C C C C H H H H H H H H H H H H
charge: -0.292820 -0.229338 0.183425 0.289255 0.049811 0.174606 -0.351221 -0.355497 -0.344551 -0.361730 -0.253465 -0.207621 -0.235581 -0.229008 -0.228546 -0.520135 0.261642 0.249039 0.264571 0.273709 0.233282 0.231776 0.231892 0.232877 0.233111 0.228864 0.205483 0.266169
chargesum: 0.00000
title: Mulliken charges with hydrogens summed into heavy atoms:
elementType: O O C C C C C C C C C C C C C C
charge: -0.292820 -0.229338 0.183425 0.289255 0.049811 0.174606 -0.089578 -0.106458 -0.079980 -0.088022 -0.020183 0.024156 -0.003689 0.003869 0.004565 0.180381
polarizability: 2.16487760e+02 4.44392587e+00 1.60049166e+02 -5.51243136e+00 -7.60334171e+00 9.30368267e+01
1716.lowfreq: -3.2244 -0.0011 -0.0008 -0.0008 5.3917 7.1436 38.1108 54.2632 67.6223
frequency: 38.0965 54.2294 67.6191 98.9435 128.0582 146.5850 165.0226 188.6084 214.5448 258.8697 295.2524 370.7722 403.2209 411.2101 433.8596 443.6995 502.7485 553.1808 579.9254 613.6352 629.7621 682.2554 691.8898 704.4948 761.3107 762.9458 778.8428 807.0575 862.9046 876.5069 912.9375 949.2946 951.8470 959.5746 986.8467 989.4142 993.0083 1007.1796 1024.8826 1035.3959 1083.2734 1094.9149 1110.1430 1149.1298 1152.7317 1171.5404 1174.0503 1187.4379 1202.1267 1258.8672 1278.3182 1317.6225 1365.8853 1386.6056 1413.2496 1434.0432 1435.2366 1452.7832 1468.3196 1477.3105 1482.6683 1542.9059 1574.5992 1590.0895 1599.2824 1608.4724 2964.1245 3072.1926 3124.0519 3128.3790 3129.6305 3138.0781 3139.2418 3150.5177 3153.5054 3159.6476 3167.7967 3169.4403
redmass: 5.6032 3.9205 4.6793 2.9066 4.3505 4.6014 1.2903 3.0978 4.6516 5.3962 5.2331 4.6588 3.2699 4.8321 4.9791 4.1149 5.3163 3.9295 4.5788 6.4508 6.0914 4.6515 4.7407 1.6434 2.6916 2.7288 1.8749 2.7304 1.2579 1.5119 5.3245 1.6745 1.8696 2.5835 1.3353 5.8224 1.3878 1.3351 2.2270 2.1577 1.5792 2.2431 1.2597 1.7619 1.5383 1.0974 1.0653 1.1472 3.2671 1.6238 3.2123 1.3551 10.8581 9.1682 1.5048 1.9870 1.7856 1.0632 2.2874 2.3230 1.0556 8.7089 6.6708 6.5692 6.3551 6.1225 1.0335 1.0997 1.1032 1.0852 1.0853 1.0896 1.0886 1.0925 1.0943 1.0960 1.1008 1.1012
irintensity: 2.4719 0.1886 1.9046 7.6604 3.1494 4.5486 0.1066 1.0027 3.3828 3.4510 3.3473 6.4677 1.1341 3.5348 1.6692 9.2606 11.0749 6.7207 1.6164 0.1110 34.5393 7.9876 5.9883 80.2168 19.8866 17.0721 54.4408 19.0498 3.0279 3.5564 68.9527 13.1699 12.3929 28.3162 0.3972 1.8902 1.6575 0.9260 3.1576 7.1503 12.8751 32.0309 6.6640 2.8945 3.9023 9.1619 0.1358 16.2883 88.4477 19.5390 260.6924 13.0282 11.3156 3.3289 14.9157 9.8668 13.6460 9.9944 52.0912 12.4542 12.0098 143.9147 45.5314 22.1215 41.4272 14.2196 85.3229 22.7845 22.7397 0.1219 0.4655 6.9340 11.1786 16.8587 17.1802 18.6023 25.2102 19.4960
temp: 298.150 k
press: 1.00000 atm
elementType: 8 8 6 6 6 6 6 6 6 6 6 6 6 6 6 6 1 1 1 1 1 1 1 1 1 1 1 1
symmnumber: 1
zpe: 573278.3 jmol-1
zpe.correction: 0.218350 hartree
zpe.thermalcorrener: 0.232249 hartree
zpe.thermalcorrenthalpy: 0.233193 hartree
zpe.thermalcorrgfe: 0.176760 hartree
zpe.sumelectzpe: -689.993705 hartree
zpe.sumelectthermal: -689.979807 hartree
zpe.sumelectthermalent: -689.978862 hartree
zpe.sumelectthermalfe: -690.035295 hartree
dipole: 0.2652 -2.5453 -0.3075
dipole: 2.5775
quadrupole: -71.6075 -87.4983 -96.8598
quadrupole: -1.0079 0.7864 -1.1232
quadrupole: 13.7144 -2.1765 -11.5379 -1.0079 0.7864 -1.1232
hfenergy: -690.2120554 hartree
pointgroup: C01 [X(C14H12O2)]
dipole: -0.0835325 -1.0071435 -0.0837207 debye
polarizability: 215.0974971|-6.5918681|159.824537|-13.4176511|-8.2973887|94.6517182 unknown
InChI: InChI=1S/C14H12O2/c1-16-13-10-6-5-9-12(13)14(15)11-7-3-2-4-8-11/h2-10H,1H3
charge 0 multiplicity 1
28 atoms
O  -1.876617 1.939378 1.175197
O  0.296584 1.935828 -0.853892
C  -0.977106 0.034394 -0.097092
C  1.62052 0.065003 -0.116017
C  0.31369 0.759854 -0.372707
C  -2.06363 0.68661 0.557899
C  -1.170152 -1.289135 -0.578498
C  -3.305623 0.027629 0.708752
C  1.732581 -1.038301 0.772758
C  2.789401 0.570979 -0.747973
C  -2.41543 -1.938596 -0.445501
C  -3.485956 -1.277364 0.201184
C  2.992062 -1.627246 1.018637
C  4.042806 -0.024969 -0.510571
C  4.147234 -1.127131 0.373931
C  -2.33044 3.115002 0.399075
H  -0.342103 -1.797521 -1.084996
H  -4.108658 0.541572 1.247878
H  0.84227 -1.414569 1.287042
H  2.685117 1.434233 -1.413713
H  -2.548915 -2.951499 -0.839552
H  -4.452055 -1.780343 0.320399
H  3.074358 -2.469514 1.714257
H  4.938164 0.365146 -1.006763
H  5.123361 -1.588116 0.562822
H  -2.205595 3.974618 1.074808
H  -3.396192 3.01085 0.113727
H  -1.694978 3.230309 -0.496088
