program: Orca
programVersion: 5.0.3
elementType: Fe P P P Cl N C C H C H C C H C C H H H C C H C H C C H C C H H H C C H C H C C H C C H H H C H C H H H C H H H C H C H H H C H H H C H C H H H C H H H C H C H H H C H H H C H C H H H C H H H C H C H H H C H H H
keywords: PBE0 D4 DKH2 RIJCOSX DKH-def2-SV(P) def2-tzvp/c damp Opt Freq UNO UCO NormalPrint CPCM(acetonitrile)
charge: 1
multiplicity: 5
frequency: 0.00 0.00 0.00 0.00 0.00 0.00 -21.18 21.12 21.87 29.76 36.63 41.62 44.29 46.21 60.16 65.65 70.90 74.89 79.84 80.65 84.39 89.03 91.61 95.54 100.61 103.70 109.81 113.50 115.51 116.84 121.98 124.10 135.65 143.47 147.08 149.15 153.52 157.33 171.68 175.47 182.62 192.35 196.82 203.14 209.34 211.03 220.51 228.90 231.04 235.41 238.47 242.44 245.05 249.11 252.81 254.70 257.58 261.11 262.13 268.65 270.24 275.33 280.60 295.85 299.68 310.02 321.18 324.75 328.28 335.84 343.61 348.90 354.81 364.90 371.20 379.31 384.63 390.70 400.63 408.83 413.80 425.66 446.17 449.59 467.25 474.69 476.10 484.02 488.27 495.64 502.05 511.46 526.13 544.56 552.49 561.87 587.41 588.08 593.10 614.20 622.62 629.82 667.10 681.21 683.00 685.42 699.84 700.93 706.14 770.42 772.61 774.05 838.22 842.20 855.13 883.41 885.36 908.27 910.11 918.48 921.73 921.80 922.86 924.02 925.38 928.34 928.81 940.87 941.15 945.36 948.13 950.36 952.17 954.58 957.16 983.64 984.00 984.93 985.63 989.10 991.19 996.05 996.79 997.54 1024.03 1024.35 1025.20 1050.81 1051.36 1051.79 1064.58 1065.41 1066.39 1070.96 1074.47 1084.45 1089.56 1105.66 1106.51 1136.48 1145.59 1147.96 1148.44 1153.26 1153.76 1176.43 1176.69 1179.57 1193.24 1194.41 1195.01 1195.34 1196.29 1198.15 1228.11 1258.48 1260.63 1265.47 1283.27 1285.15 1287.02 1293.71 1295.85 1298.48 1301.65 1308.59 1315.19 1321.94 1326.50 1335.01 1337.58 1338.96 1341.26 1349.01 1350.43 1375.11 1389.34 1389.79 1405.29 1405.94 1406.80 1407.08 1408.89 1409.95 1413.37 1414.03 1414.33 1418.33 1418.87 1419.94 1423.06 1424.35 1430.57 1441.12 1441.87 1442.89 1472.60 1473.15 1474.88 1476.09 1476.99 1478.40 1479.66 1480.78 1483.28 1483.67 1484.90 1485.28 1486.18 1487.19 1487.38 1487.57 1488.41 1489.87 1491.24 1491.89 1493.60 1494.34 1497.23 1498.39 1501.46 1501.91 1504.33 1507.96 1510.73 1517.28 1540.56 1541.85 1549.48 1645.90 1651.33 1652.54 1687.68 1688.54 1691.81 3054.87 3055.55 3058.32 3058.37 3059.00 3059.60 3060.65 3061.77 3063.17 3065.25 3066.53 3069.37 3069.60 3070.81 3074.72 3086.16 3088.45 3091.57 3115.83 3125.60 3132.73 3140.08 3140.50 3140.84 3141.01 3141.32 3143.25 3146.46 3147.64 3147.92 3148.38 3151.27 3153.92 3154.53 3156.60 3158.01 3161.19 3168.11 3168.73 3169.04 3169.99 3172.53 3172.79 3173.46 3174.20 3177.59 3181.00 3183.16 3185.93 3188.31 3211.70 3215.48 3216.99 3217.68 3226.04 3226.96 3236.06 3237.55 3239.79 3260.11
frequency: 21.12 21.87 29.76 36.63 41.62 44.29 46.21 60.16 65.65 70.90 74.89 79.84 80.65 84.39 89.03 91.61 95.54 100.61 103.70 109.81 113.50 115.51 116.84 121.98 124.10 135.65 143.47 147.08 149.15 153.52 157.33 171.68 175.47 182.62 192.35 196.82 203.14 209.34 211.03 220.51 228.90 231.04 235.41 238.47 242.44 245.05 249.11 252.81 254.70 257.58 261.11 262.13 268.65 270.24 275.33 280.60 295.85 299.68 310.02 321.18 324.75 328.28 335.84 343.61 348.90 354.81 364.90 371.20 379.31 384.63 390.70 400.63 408.83 413.80 425.66 446.17 449.59 467.25 474.69 476.10 484.02 488.27 495.64 502.05 511.46 526.13 544.56 552.49 561.87 587.41 588.08 593.10 614.20 622.62 629.82 667.10 681.21 683.00 685.42 699.84 700.93 706.14 770.42 772.61 774.05 838.22 842.20 855.13 883.41 885.36 908.27 910.11 918.48 921.73 921.80 922.86 924.02 925.38 928.34 928.81 940.87 941.15 945.36 948.13 950.36 952.17 954.58 957.16 983.64 984.00 984.93 985.63 989.10 991.19 996.05 996.79 997.54 1024.03 1024.35 1025.20 1050.81 1051.36 1051.79 1064.58 1065.41 1066.39 1070.96 1074.47 1084.45 1089.56 1105.66 1106.51 1136.48 1145.59 1147.96 1148.44 1153.26 1153.76 1176.43 1176.69 1179.57 1193.24 1194.41 1195.01 1195.34 1196.29 1198.15 1228.11 1258.48 1260.63 1265.47 1283.27 1285.15 1287.02 1293.71 1295.85 1298.48 1301.65 1308.59 1315.19 1321.94 1326.50 1335.01 1337.58 1338.96 1341.26 1349.01 1350.43 1375.11 1389.34 1389.79 1405.29 1405.94 1406.80 1407.08 1408.89 1409.95 1413.37 1414.03 1414.33 1418.33 1418.87 1419.94 1423.06 1424.35 1430.57 1441.12 1441.87 1442.89 1472.60 1473.15 1474.88 1476.09 1476.99 1478.40 1479.66 1480.78 1483.28 1483.67 1484.90 1485.28 1486.18 1487.19 1487.38 1487.57 1488.41 1489.87 1491.24 1491.89 1493.60 1494.34 1497.23 1498.39 1501.46 1501.91 1504.33 1507.96 1510.73 1517.28 1540.56 1541.85 1549.48 1645.90 1651.33 1652.54 1687.68 1688.54 1691.81 3054.87 3055.55 3058.32 3058.37 3059.00 3059.60 3060.65 3061.77 3063.17 3065.25 3066.53 3069.37 3069.60 3070.81 3074.72 3086.16 3088.45 3091.57 3115.83 3125.60 3132.73 3140.08 3140.50 3140.84 3141.01 3141.32 3143.25 3146.46 3147.64 3147.92 3148.38 3151.27 3153.92 3154.53 3156.60 3158.01 3161.19 3168.11 3168.73 3169.04 3169.99 3172.53 3172.79 3173.46 3174.20 3177.59 3181.00 3183.16 3185.93 3188.31 3211.70 3215.48 3216.99 3217.68 3226.04 3226.96 3236.06 3237.55 3239.79 3260.11
formula: C39H60ClFeNP3
InChI: InChI=1/C39H60NP3.ClH.Fe/c1-25(2)41(26(3)4)37-22-31(13)16-19-34(37)40(35-20-17-32(14)23-38(35)42(27(5)6)28(7)8)36-21-18-33(15)24-39(36)43(29(9)10)30(11)12;;/h16-30H,1-15H3;1H;/q;;+1/p-1/rC39H60NP3.ClFe/c1-25(2)41(26(3)4)37-22-31(13)16-19-34(37)40(35-20-17-32(14)23-38(35)42(27(5)6)28(7)8)36-21-18-33(15)24-39(36)43(29(9)10)30(11)12;1-2/h16-30H,1-15H3;
105 atoms
Fe -0.001317 -0.001924 0.003181
P  -0.845874 -2.218962 -0.708331
P  -1.660484 1.668568 -0.652426
P  2.130662 0.676954 -1.069907
Cl 0.005025 0.013842 2.271412
N  -0.298471 -0.033517 -2.765013
C  0.267399 -1.299797 -3.118244
C  1.03407 -1.434264 -4.279251
H  1.208884 -0.564705 -4.910346
C  1.572159 -2.665956 -4.632966
H  2.173967 -2.744573 -5.539127
C  1.337504 -3.80576 -3.854311
C  0.556592 -3.659622 -2.70461
H  0.369705 -4.543939 -2.096375
C  0.033963 -2.42385 -2.305413
C  1.925171 -5.135736 -4.229772
H  1.804052 -5.336549 -5.303004
H  1.455111 -5.953396 -3.669297
H  3.004235 -5.160863 -4.015387
C  -1.719167 0.061316 -2.94103
C  -2.351894 -0.651658 -3.9613
H  -1.764186 -1.304467 -4.604787
C  -3.725166 -0.543459 -4.153458
H  -4.200573 -1.122177 -4.946149
C  -4.4988 0.302988 -3.351673
C  -3.849692 1.016636 -2.337843
H  -4.454079 1.660676 -1.700095
C  -2.475592 0.900806 -2.102693
C  -5.975043 0.456523 -3.579223
H  -6.17207 1.206257 -4.360951
H  -6.489034 0.788428 -2.668235
H  -6.428672 -0.486505 -3.91089
C  0.415145 1.118903 -3.234552
C  -0.076094 1.847576 -4.322906
H  -0.98047 1.512384 -4.827181
C  0.556885 3.009282 -4.746993
H  0.143377 3.566591 -5.588175
C  1.709336 3.472763 -4.102019
C  2.204733 2.721091 -3.033136
H  3.090932 3.09212 -2.525432
C  1.583902 1.549274 -2.582112
C  2.395793 4.73124 -4.548671
H  3.146815 5.058536 -3.818998
H  1.674885 5.547644 -4.692005
H  2.907062 4.578075 -5.510937
C  -0.174283 -3.596978 0.355723
H  -0.397478 -4.549928 -0.147134
C  1.337017 -3.424713 0.494449
H  1.565124 -2.498179 1.041121
H  1.862564 -3.395183 -0.46716
H  1.75018 -4.260809 1.077079
C  -0.802793 -3.616267 1.751332
H  -0.244156 -4.327764 2.377032
H  -1.847445 -3.936906 1.74815
H  -0.740177 -2.629813 2.230645
C  -2.636593 -2.600367 -1.120315
H  -2.978788 -1.663966 -1.579589
C  -2.780074 -3.725001 -2.139392
H  -2.375115 -4.672535 -1.754651
H  -2.278659 -3.496956 -3.087728
H  -3.847759 -3.882714 -2.353849
C  -3.512151 -2.86319 0.103964
H  -4.56435 -2.717544 -0.179676
H  -3.297094 -2.192731 0.943914
H  -3.40928 -3.898534 0.452345
C  -3.04507 1.929655 0.563517
H  -3.827893 2.507266 0.05069
C  -3.612693 0.579812 0.990854
H  -2.850376 -0.012743 1.514579
H  -3.982183 -0.006934 0.140988
H  -4.454532 0.734931 1.681652
C  -2.57916 2.731901 1.77869
H  -3.375745 2.724634 2.536901
H  -2.372962 3.77959 1.533889
H  -1.680523 2.292489 2.232903
C  -1.125813 3.355312 -1.247957
H  -0.524972 3.109325 -2.132312
C  -2.285152 4.235433 -1.699121
H  -2.924881 4.534121 -0.856766
H  -2.911846 3.732698 -2.448377
H  -1.891256 5.154677 -2.157722
C  -0.20336 4.059633 -0.253735
H  0.371073 4.837869 -0.77641
H  0.513469 3.369072 0.209609
H  -0.761749 4.548781 0.55304
C  3.157422 1.931657 -0.136849
H  2.590306 2.860329 -0.302612
C  4.594406 2.15424 -0.610451
H  4.996612 3.040814 -0.098568
H  4.689873 2.324405 -1.688226
H  5.241121 1.308399 -0.349317
C  3.12997 1.639124 1.3636
H  3.64266 0.698093 1.604948
H  2.107056 1.570881 1.752693
H  3.650623 2.447158 1.898218
C  3.224573 -0.733778 -1.635495
H  2.488728 -1.491972 -1.935274
C  4.092945 -0.42573 -2.849427
H  4.889375 0.292492 -2.61951
H  3.502924 -0.028651 -3.68514
H  4.571503 -1.355375 -3.191829
C  4.026589 -1.316472 -0.472652
H  4.430043 -2.295087 -0.7699
H  3.412835 -1.47016 0.423354
H  4.876482 -0.681094 -0.196035
elementType: Fe P Cl N C H
totalener: -4334.24062118 hartree
nucrepener: 8696.63541228 hartree
cpcmener: -0.06306462 hartree
kineticenergy: 4407.04426624 hartree
exchangeener: -284.686524889045 hartree
correlationener: -13.562382619381 hartree
xcener: -298.248907508425 hartree
s2: 6.021495
dispersion: -0.182395370 hartree
s2: 6.021369
dispersion: -0.182431401 hartree
s2: 6.021226
dispersion: -0.182393353 hartree
s2: 6.021276
dispersion: -0.182505497 hartree
s2: 6.021271
dispersion: -0.182161968 hartree
s2: 6.021222
dispersion: -0.182128021 hartree
s2: 6.021172
dispersion: -0.182520417 hartree
s2: 6.021175
dispersion: -0.182053265 hartree
s2: 6.021162
dispersion: -0.182030700 hartree
s2: 6.021174
dispersion: -0.182795588 hartree
s2: 6.021143
dispersion: -0.182287604 hartree
dispersion: -0.182156912 hartree
s2: 6.021135
dispersion: -0.182232173 hartree
s2: 6.021117
dispersion: -0.182333641 hartree
s2: 6.021126
dispersion: -0.182275424 hartree
s2: 6.021130
chargesum: 1.0000000
charge: 0.232507 0.422916 0.447060 0.427442 -0.342444 -0.400011 0.089296 -0.178483 0.200733 -0.201268 0.182274 0.058525 -0.282634 0.189187 -0.105299 -0.483197 0.195721 0.193636 0.202313 0.063753 -0.171725 0.200617 -0.207868 0.182592 0.054052 -0.289890 0.188618 -0.064440 -0.482501 0.204051 0.193918 0.194680 0.057638 -0.167280 0.198299 -0.206013 0.183687 0.060661 -0.288162 0.188005 -0.068714 -0.485004 0.194101 0.197162 0.202784 -0.424523 0.228506 -0.533773 0.211194 0.218633 0.196886 -0.475761 0.187571 0.190481 0.178886 -0.439764 0.259094 -0.472808 0.189944 0.202833 0.189399 -0.491534 0.192828 0.208880 0.200437 -0.435227 0.230350 -0.519169 0.196746 0.212726 0.192457 -0.477350 0.188387 0.197766 0.178187 -0.441735 0.260523 -0.470095 0.191307 0.192350 0.189638 -0.493603 0.190488 0.218728 0.190192 -0.469990 0.240151 -0.483601 0.193229 0.209601 0.197380 -0.482098 0.187257 0.200162 0.188189 -0.460879 0.261232 -0.459546 0.189564 0.198661 0.186950 -0.490001 0.195110 0.210050 0.197205
charge: -1.076831 0.807056 0.824946 0.809487 0.036558 -0.000919 0.000068 -0.150452 0.167595 -0.123575 0.162727 -0.050100 -0.131424 0.159537 -0.171792 -0.384849 0.158162 0.153908 0.162217 -0.001646 -0.148873 0.167959 -0.127679 0.162858 -0.048687 -0.134774 0.159218 -0.167607 -0.384782 0.163168 0.155024 0.156800 -0.003017 -0.149502 0.168716 -0.126987 0.163357 -0.047603 -0.137008 0.159233 -0.169978 -0.384714 0.153925 0.159089 0.162623 -0.284018 0.155419 -0.395958 0.150873 0.144610 0.153385 -0.401609 0.149331 0.145063 0.137800 -0.283246 0.159754 -0.397043 0.145211 0.144128 0.150294 -0.395902 0.151891 0.145515 0.145533 -0.285000 0.153980 -0.399110 0.146017 0.143569 0.150802 -0.399337 0.150061 0.143710 0.138965 -0.288848 0.162159 -0.397715 0.145177 0.144814 0.150531 -0.395179 0.150460 0.146439 0.144585 -0.288554 0.160058 -0.398658 0.153899 0.143516 0.145729 -0.398665 0.145066 0.142514 0.149333 -0.283685 0.160423 -0.397305 0.145167 0.144055 0.150291 -0.395975 0.153147 0.147171 0.143936
qa: 0.2325 0.4229 0.4471 0.4274 -0.3424 -0.4000 0.0893 -0.1785 0.2007 -0.2013 0.1823 0.0585 -0.2826 0.1892 -0.1053 -0.4832 0.1957 0.1936 0.2023 0.0638 -0.1717 0.2006 -0.2079 0.1826 0.0541 -0.2899 0.1886 -0.0644 -0.4825 0.2041 0.1939 0.1947 0.0576 -0.1673 0.1983 -0.2060 0.1837 0.0607 -0.2882 0.1880 -0.0687 -0.4850 0.1941 0.1972 0.2028 -0.4245 0.2285 -0.5338 0.2112 0.2186 0.1969 -0.4758 0.1876 0.1905 0.1789 -0.4398 0.2591 -0.4728 0.1899 0.2028 0.1894 -0.4915 0.1928 0.2089 0.2004 -0.4352 0.2303 -0.5192 0.1967 0.2127 0.1925 -0.4774 0.1884 0.1978 0.1782 -0.4417 0.2605 -0.4701 0.1913 0.1923 0.1896 -0.4936 0.1905 0.2187 0.1902 -0.4700 0.2402 -0.4836 0.1932 0.2096 0.1974 -0.4821 0.1873 0.2002 0.1882 -0.4609 0.2612 -0.4595 0.1896 0.1987 0.1870 -0.4900 0.1951 0.2101 0.1972
va: 6.6078 3.6971 3.7274 3.6789 1.2037 3.0588 3.9779 3.8097 0.9326 3.8201 0.9388 3.9085 3.8959 0.9437 3.8469 3.8150 0.9263 0.9324 0.9215 3.9915 3.7987 0.9323 3.8248 0.9390 3.9123 3.8949 0.9446 3.8440 3.8158 0.9207 0.9308 0.9285 4.0005 3.8029 0.9329 3.8175 0.9380 3.9159 3.8972 0.9470 3.8357 3.8163 0.9327 0.9255 0.9216 3.9158 0.9026 3.7668 0.9464 0.9217 0.9281 3.7789 0.9312 0.9386 0.9796 3.9160 0.8702 3.7915 0.9319 0.9274 0.9305 3.8018 0.9271 0.9244 0.9249 3.9356 0.9011 3.7666 0.9686 0.9224 0.9288 3.7787 0.9317 0.9326 0.9745 3.9085 0.8648 3.8022 0.9315 0.9328 0.9286 3.7904 0.9287 0.9277 0.9373 3.9271 0.8958 3.7816 0.9283 0.9242 0.9364 3.7818 0.9359 0.9670 0.9298 3.9207 0.8670 3.7871 0.9364 0.9307 0.9323 3.7831 0.9275 0.9275 0.9352
dispersion: -0.182245059 hartree
energy: -4334.423696883539 hartree
dipole: 2.90273 -2.94809 -0.04536 -0.11655 0.05352 -0.06303 -6.16364 3.02149 -3.14214
magnitude: 3.14310 au
magnitude: 7.98914 debye
temp: 298.15 k
press: 1.00 atm
zeropoint: 0.91517232 hartree
thermalvibcorrection: 0.05093838 hartree
thermalrotcorrection: 0.00141627 hartree
thermaltrasncorrection: 0.00141627 hartree
thermaltotal: -4333.45475363 hartree
thermalcorr: 0.05377093 hartree
nonthermalcorr: 0.91517232 hartree
totalcorr: 0.96894325 hartree
thermalcorrenthalpy: 0.00094421 hartree
totalenthalpy: -4333.45380942 hartree
vibrat: 0.09129767 hartree
rotat: 0.01813858 hartree
transl: 0.02168105 hartree
total: 0.13263690 hartree
totalentropycorr: -0.13263690 hartree
gibbsenthalpy: -4333.58644632 hartree
gibbsminuselec: 0.83725056 hartree
