program: Orca
programVersion: 5.0.3
elementType: Fe P P P Cl N C C H C H C C H C C H H H C C H C H C C H C C H H H C C H C H C C H C C H H H C H C H H H C H H H C H C H H H C H H H C H C H H H C H H H C H C H H H C H H H C H C H H H C H H H C H C H H H C H H H
keywords: PBE0 D4 DKH2 RIJCOSX DKH-def2-SV(P) def2-tzvp/c damp Opt Freq UNO UCO NormalPrint CPCM(acetonitrile)
charge: 0
multiplicity: 4
frequency: 0.00 0.00 0.00 0.00 0.00 0.00 -19.79 15.96 30.83 35.50 39.67 41.71 46.14 52.52 63.67 71.69 74.84 77.50 82.62 87.44 89.79 93.94 95.60 102.54 104.40 105.07 114.03 117.05 119.76 127.93 130.40 132.05 138.27 145.41 147.78 152.38 156.28 160.61 180.33 182.55 184.44 190.23 197.27 204.50 211.41 218.16 226.36 229.31 232.60 236.74 241.90 243.18 248.64 249.67 253.26 255.63 261.17 262.11 263.27 268.48 270.90 273.28 279.38 285.98 298.60 300.55 311.76 323.16 324.09 337.36 341.64 345.49 354.02 366.37 369.12 376.92 383.08 387.12 398.28 409.71 414.97 426.17 444.16 451.64 464.66 467.47 475.53 481.10 484.83 495.16 497.48 509.75 523.86 545.50 553.16 563.52 579.60 590.62 594.25 602.33 609.73 623.24 653.19 669.92 672.26 675.20 697.65 698.02 704.11 769.06 771.57 772.88 833.32 837.76 848.62 878.35 882.03 902.51 909.32 917.72 919.47 920.74 922.13 922.97 925.74 928.42 931.28 936.44 936.79 942.25 943.97 950.56 952.67 955.68 956.19 980.83 981.14 982.52 983.55 985.66 987.21 988.33 989.75 990.58 1022.55 1022.74 1023.56 1044.81 1046.09 1047.05 1063.27 1063.65 1064.67 1065.57 1070.00 1079.88 1088.84 1104.22 1105.28 1135.01 1141.30 1145.96 1146.17 1148.47 1154.21 1169.38 1170.97 1172.34 1192.01 1192.27 1193.10 1194.60 1196.27 1199.98 1231.65 1257.27 1259.67 1264.15 1279.31 1280.98 1283.71 1292.27 1293.50 1301.47 1302.68 1304.47 1310.32 1330.32 1338.24 1338.80 1340.16 1340.87 1341.40 1349.15 1352.27 1369.94 1385.01 1385.89 1401.20 1401.77 1401.96 1402.94 1405.30 1406.27 1412.21 1412.66 1412.89 1413.24 1414.65 1415.11 1417.79 1419.60 1426.36 1439.61 1442.38 1443.75 1473.93 1473.98 1475.80 1475.99 1476.73 1478.21 1478.92 1480.41 1483.00 1483.30 1483.74 1484.76 1485.64 1486.49 1486.92 1488.15 1489.08 1489.70 1491.63 1492.48 1493.25 1494.35 1496.50 1501.21 1501.43 1503.02 1506.37 1507.24 1511.28 1517.87 1537.17 1540.42 1547.31 1642.59 1648.38 1650.79 1683.97 1684.41 1689.29 3046.48 3047.55 3047.90 3049.76 3051.63 3052.63 3054.45 3054.94 3055.39 3055.56 3056.22 3060.00 3060.79 3062.31 3066.08 3073.31 3081.61 3082.17 3114.91 3115.85 3125.28 3127.86 3133.46 3133.61 3134.71 3134.83 3135.38 3135.71 3136.01 3136.51 3139.32 3141.48 3142.59 3145.77 3147.38 3153.22 3153.36 3160.28 3163.17 3163.79 3163.83 3164.17 3165.39 3166.87 3171.45 3172.57 3176.64 3177.52 3178.44 3184.75 3204.54 3208.85 3209.54 3209.79 3219.10 3220.32 3229.47 3229.93 3230.41 3262.92
frequency: 15.96 30.83 35.50 39.67 41.71 46.14 52.52 63.67 71.69 74.84 77.50 82.62 87.44 89.79 93.94 95.60 102.54 104.40 105.07 114.03 117.05 119.76 127.93 130.40 132.05 138.27 145.41 147.78 152.38 156.28 160.61 180.33 182.55 184.44 190.23 197.27 204.50 211.41 218.16 226.36 229.31 232.60 236.74 241.90 243.18 248.64 249.67 253.26 255.63 261.17 262.11 263.27 268.48 270.90 273.28 279.38 285.98 298.60 300.55 311.76 323.16 324.09 337.36 341.64 345.49 354.02 366.37 369.12 376.92 383.08 387.12 398.28 409.71 414.97 426.17 444.16 451.64 464.66 467.47 475.53 481.10 484.83 495.16 497.48 509.75 523.86 545.50 553.16 563.52 579.60 590.62 594.25 602.33 609.73 623.24 653.19 669.92 672.26 675.20 697.65 698.02 704.11 769.06 771.57 772.88 833.32 837.76 848.62 878.35 882.03 902.51 909.32 917.72 919.47 920.74 922.13 922.97 925.74 928.42 931.28 936.44 936.79 942.25 943.97 950.56 952.67 955.68 956.19 980.83 981.14 982.52 983.55 985.66 987.21 988.33 989.75 990.58 1022.55 1022.74 1023.56 1044.81 1046.09 1047.05 1063.27 1063.65 1064.67 1065.57 1070.00 1079.88 1088.84 1104.22 1105.28 1135.01 1141.30 1145.96 1146.17 1148.47 1154.21 1169.38 1170.97 1172.34 1192.01 1192.27 1193.10 1194.60 1196.27 1199.98 1231.65 1257.27 1259.67 1264.15 1279.31 1280.98 1283.71 1292.27 1293.50 1301.47 1302.68 1304.47 1310.32 1330.32 1338.24 1338.80 1340.16 1340.87 1341.40 1349.15 1352.27 1369.94 1385.01 1385.89 1401.20 1401.77 1401.96 1402.94 1405.30 1406.27 1412.21 1412.66 1412.89 1413.24 1414.65 1415.11 1417.79 1419.60 1426.36 1439.61 1442.38 1443.75 1473.93 1473.98 1475.80 1475.99 1476.73 1478.21 1478.92 1480.41 1483.00 1483.30 1483.74 1484.76 1485.64 1486.49 1486.92 1488.15 1489.08 1489.70 1491.63 1492.48 1493.25 1494.35 1496.50 1501.21 1501.43 1503.02 1506.37 1507.24 1511.28 1517.87 1537.17 1540.42 1547.31 1642.59 1648.38 1650.79 1683.97 1684.41 1689.29 3046.48 3047.55 3047.90 3049.76 3051.63 3052.63 3054.45 3054.94 3055.39 3055.56 3056.22 3060.00 3060.79 3062.31 3066.08 3073.31 3081.61 3082.17 3114.91 3115.85 3125.28 3127.86 3133.46 3133.61 3134.71 3134.83 3135.38 3135.71 3136.01 3136.51 3139.32 3141.48 3142.59 3145.77 3147.38 3153.22 3153.36 3160.28 3163.17 3163.79 3163.83 3164.17 3165.39 3166.87 3171.45 3172.57 3176.64 3177.52 3178.44 3184.75 3204.54 3208.85 3209.54 3209.79 3219.10 3220.32 3229.47 3229.93 3230.41 3262.92
formula: C39H60ClFeNP3
InChI: InChI=1/C39H60NP3.ClH.Fe/c1-25(2)41(26(3)4)37-22-31(13)16-19-34(37)40(35-20-17-32(14)23-38(35)42(27(5)6)28(7)8)36-21-18-33(15)24-39(36)43(29(9)10)30(11)12;;/h16-30H,1-15H3;1H;/q;;+1/p-1/rC39H60ClFeNP3/c1-25(2)43(26(3)4)37-22-31(13)16-19-34(37)42-35-20-17-32(14)23-38(35)44(27(5)6,28(7)8)41(43,40)45(29(9)10,30(11)12)39-24-33(15)18-21-36(39)42/h16-30H,1-15H3
105 atoms
Fe 0.001379 0.006676 0.024506
P  -0.729211 -2.155419 -0.655104
P  -1.601601 1.590241 -0.638046
P  2.038414 0.564073 -1.081947
Cl 0.089635 0.000646 2.394261
N  -0.368073 -0.086813 -2.862966
C  0.18822 -1.353988 -3.191991
C  0.893826 -1.522309 -4.385616
H  1.017263 -0.671785 -5.054519
C  1.435528 -2.759417 -4.723786
H  1.990059 -2.866541 -5.657065
C  1.258973 -3.8674 -3.890122
C  0.538688 -3.685333 -2.702803
H  0.402546 -4.549357 -2.052843
C  0.021741 -2.445066 -2.315982
C  1.840837 -5.210347 -4.232156
H  2.138619 -5.260227 -5.287334
H  1.123013 -6.019198 -4.03807
H  2.734938 -5.41942 -3.62504
C  -1.786214 0.020952 -2.960726
C  -2.47596 -0.698649 -3.939407
H  -1.919966 -1.348839 -4.613636
C  -3.860669 -0.605446 -4.050901
H  -4.378066 -1.189941 -4.812962
C  -4.589487 0.236073 -3.205691
C  -3.884003 0.95595 -2.232404
H  -4.456962 1.592944 -1.559097
C  -2.498372 0.854216 -2.071802
C  -6.078895 0.38391 -3.339356
H  -6.332934 1.256066 -3.961569
H  -6.556442 0.533174 -2.361751
H  -6.52855 -0.498465 -3.812749
C  0.356577 1.066472 -3.284824
C  -0.120424 1.818351 -4.364538
H  -1.009039 1.477398 -4.893945
C  0.496761 3.005594 -4.74124
H  0.093906 3.58164 -5.575353
C  1.620219 3.468162 -4.048146
C  2.105192 2.689035 -2.992463
H  2.968125 3.068036 -2.452467
C  1.506212 1.488693 -2.588561
C  2.297235 4.753239 -4.43311
H  2.956272 5.113177 -3.632831
H  1.564433 5.540631 -4.656098
H  2.913363 4.619844 -5.335609
C  -0.053594 -3.585355 0.354128
H  -0.345713 -4.527967 -0.133723
C  1.46832 -3.489099 0.422175
H  1.759836 -2.586568 0.976767
H  1.948694 -3.449466 -0.562626
H  1.873901 -4.359023 0.960827
C  -0.598741 -3.583043 1.785115
H  -0.038925 -4.319298 2.382243
H  -1.655981 -3.854451 1.844631
H  -0.46533 -2.596982 2.252684
C  -2.536428 -2.600407 -0.993755
H  -2.90669 -1.68356 -1.471273
C  -2.72678 -3.755854 -1.969687
H  -2.288474 -4.688853 -1.584465
H  -2.278915 -3.549155 -2.949288
H  -3.802248 -3.936122 -2.123921
C  -3.371058 -2.828512 0.265779
H  -4.434651 -2.680349 0.026153
H  -3.115481 -2.144021 1.082801
H  -3.263771 -3.857183 0.634289
C  -2.968947 1.911477 0.595627
H  -3.762451 2.486222 0.095674
C  -3.538804 0.58772 1.092737
H  -2.762287 0.020154 1.623564
H  -3.921311 -0.036095 0.275285
H  -4.368667 0.771774 1.792588
C  -2.450944 2.735757 1.773888
H  -3.231842 2.797699 2.547308
H  -2.193594 3.762191 1.488512
H  -1.567591 2.26253 2.22567
C  -1.165204 3.299672 -1.292296
H  -0.667264 3.055573 -2.238814
C  -2.364013 4.183163 -1.61566
H  -2.89588 4.50486 -0.708888
H  -3.083638 3.671535 -2.269875
H  -2.029169 5.0926 -2.138464
C  -0.134627 4.007838 -0.416441
H  0.358352 4.808547 -0.98771
H  0.642682 3.311976 -0.075056
H  -0.585134 4.468058 0.472173
C  3.163335 1.790118 -0.200536
H  2.591539 2.726836 -0.284074
C  4.568569 2.044399 -0.749696
H  4.997458 2.920935 -0.240096
H  4.601936 2.241832 -1.826566
H  5.237464 1.198709 -0.550673
C  3.242499 1.444455 1.287287
H  3.813451 0.520391 1.454922
H  2.248654 1.303395 1.730945
H  3.759135 2.25262 1.827769
C  3.151553 -0.79407 -1.771644
H  2.415922 -1.560409 -2.049128
C  3.945237 -0.44443 -3.025429
H  4.739925 0.285106 -2.825104
H  3.302772 -0.038956 -3.817312
H  4.424303 -1.354201 -3.419975
C  4.042854 -1.398503 -0.687469
H  4.432539 -2.368688 -1.030658
H  3.500474 -1.574514 0.249123
H  4.907022 -0.762176 -0.461119
elementType: Fe P Cl N C H
totalener: -4334.34566254 hartree
nucrepener: 8741.55907990 hartree
cpcmener: -0.02788860 hartree
kineticenergy: 4407.13692572 hartree
exchangeener: -284.875556810996 hartree
correlationener: -13.617043518388 hartree
xcener: -298.492600329384 hartree
s2: 3.809851
dispersion: -0.187203657 hartree
s2: 3.809910
dispersion: -0.186921548 hartree
s2: 3.809953
dispersion: -0.186443420 hartree
s2: 3.809952
dispersion: -0.186426740 hartree
s2: 3.809618
dispersion: -0.186264265 hartree
s2: 3.809614
dispersion: -0.186412774 hartree
s2: 3.809438
dispersion: -0.186367680 hartree
s2: 3.809487
dispersion: -0.186040270 hartree
s2: 3.809423
dispersion: -0.186268610 hartree
s2: 3.809266
dispersion: -0.186411083 hartree
s2: 3.809459
dispersion: -0.185924145 hartree
s2: 3.809391
dispersion: -0.186015623 hartree
s2: 3.809159
dispersion: -0.186644461 hartree
s2: 3.809245
dispersion: -0.186214835 hartree
s2: 3.809435
dispersion: -0.185927551 hartree
s2: 3.809264
dispersion: -0.186158667 hartree
s2: 3.809254
dispersion: -0.186158595 hartree
s2: 3.809203
dispersion: -0.186159579 hartree
s2: 3.809196
chargesum: -0.0000000
charge: -0.028680 0.447384 0.446654 0.459024 -0.453742 -0.375437 0.103161 -0.182959 0.184152 -0.228445 0.171559 0.060259 -0.294927 0.175995 -0.103180 -0.484125 0.187463 0.191529 0.196893 0.084130 -0.179525 0.186130 -0.227888 0.172182 0.053731 -0.298504 0.176298 -0.075448 -0.483435 0.198066 0.190073 0.188650 0.068111 -0.177616 0.183706 -0.224784 0.172939 0.064035 -0.306125 0.177777 -0.073834 -0.485764 0.189651 0.190877 0.197740 -0.420141 0.207550 -0.519215 0.200186 0.207910 0.180972 -0.479845 0.173496 0.179132 0.166756 -0.438701 0.246785 -0.467008 0.178135 0.192781 0.175299 -0.489597 0.180550 0.198969 0.190310 -0.428795 0.209515 -0.507397 0.183722 0.202642 0.177076 -0.479944 0.175752 0.188453 0.168202 -0.440702 0.249468 -0.468822 0.182112 0.182848 0.177551 -0.490470 0.176421 0.216699 0.177901 -0.475857 0.226104 -0.476924 0.179521 0.199726 0.187259 -0.482485 0.173827 0.188252 0.173382 -0.456162 0.249470 -0.454653 0.177899 0.189480 0.171856 -0.487784 0.181467 0.199744 0.185572
charge: -1.476441 0.831293 0.843397 0.833276 -0.115771 -0.002164 0.001508 -0.155850 0.160356 -0.143336 0.156277 -0.059898 -0.140455 0.153164 -0.162734 -0.386225 0.151083 0.154859 0.158521 0.002612 -0.156255 0.161239 -0.143908 0.156681 -0.059519 -0.145659 0.152660 -0.162838 -0.386071 0.159209 0.153558 0.152243 -0.001246 -0.157568 0.161635 -0.144235 0.157115 -0.057094 -0.147657 0.154048 -0.156773 -0.385899 0.151504 0.154836 0.159143 -0.288738 0.143396 -0.396129 0.145290 0.139828 0.143906 -0.406701 0.141013 0.139721 0.132656 -0.290641 0.154428 -0.397946 0.138670 0.139895 0.141863 -0.396690 0.143956 0.141224 0.139848 -0.288890 0.142550 -0.398716 0.142800 0.139385 0.141768 -0.401468 0.142636 0.137820 0.135725 -0.294524 0.157818 -0.398801 0.139890 0.140353 0.143266 -0.395900 0.142303 0.142009 0.138272 -0.294889 0.150708 -0.400637 0.146175 0.139021 0.140730 -0.403440 0.138673 0.139058 0.140423 -0.291086 0.155084 -0.398157 0.139224 0.139522 0.141547 -0.396638 0.144861 0.141967 0.138095
qa: -0.0287 0.4474 0.4467 0.4590 -0.4537 -0.3754 0.1032 -0.1830 0.1842 -0.2284 0.1716 0.0603 -0.2949 0.1760 -0.1032 -0.4841 0.1875 0.1915 0.1969 0.0841 -0.1795 0.1861 -0.2279 0.1722 0.0537 -0.2985 0.1763 -0.0754 -0.4834 0.1981 0.1901 0.1887 0.0681 -0.1776 0.1837 -0.2248 0.1729 0.0640 -0.3061 0.1778 -0.0738 -0.4858 0.1897 0.1909 0.1977 -0.4201 0.2076 -0.5192 0.2002 0.2079 0.1810 -0.4798 0.1735 0.1791 0.1668 -0.4387 0.2468 -0.4670 0.1781 0.1928 0.1753 -0.4896 0.1805 0.1990 0.1903 -0.4288 0.2095 -0.5074 0.1837 0.2026 0.1771 -0.4799 0.1758 0.1885 0.1682 -0.4407 0.2495 -0.4688 0.1821 0.1828 0.1776 -0.4905 0.1764 0.2167 0.1779 -0.4759 0.2261 -0.4769 0.1795 0.1997 0.1873 -0.4825 0.1738 0.1883 0.1734 -0.4562 0.2495 -0.4547 0.1779 0.1895 0.1719 -0.4878 0.1815 0.1997 0.1856
va: 5.5216 3.6819 3.7040 3.6560 1.0166 3.0895 3.9997 3.7942 0.9404 3.8381 0.9424 3.8963 3.8676 0.9439 3.8307 3.8187 0.9332 0.9271 0.9224 4.0031 3.7922 0.9382 3.8312 0.9417 3.9028 3.8837 0.9460 3.8306 3.8188 0.9217 0.9295 0.9316 4.0152 3.7911 0.9393 3.8172 0.9405 3.9026 3.8915 0.9473 3.8234 3.8190 0.9330 0.9276 0.9221 3.9162 0.9086 3.7801 0.9475 0.9254 0.9303 3.7760 0.9334 0.9410 1.0031 3.9126 0.8744 3.8040 0.9351 0.9303 0.9326 3.8127 0.9287 0.9298 0.9258 3.9322 0.9079 3.7722 0.9819 0.9258 0.9312 3.7781 0.9335 0.9340 0.9912 3.9003 0.8718 3.8142 0.9331 0.9363 0.9303 3.7948 0.9319 0.9352 0.9392 3.9173 0.9029 3.7876 0.9306 0.9262 0.9384 3.7787 0.9393 0.9914 0.9317 3.9172 0.8714 3.7979 0.9385 0.9324 0.9351 3.7982 0.9297 0.9321 0.9366
dispersion: -0.186135639 hartree
energy: -4334.533968631175 hartree
dipole: 3.46241 -3.81292 -0.35052 -0.63507 0.59930 -0.03577 -6.64710 2.01748 -4.62961
magnitude: 4.64300 au
magnitude: 11.80158 debye
temp: 298.15 k
press: 1.00 atm
zeropoint: 0.91359389 hartree
thermalvibcorrection: 0.05076391 hartree
thermalrotcorrection: 0.00141627 hartree
thermaltrasncorrection: 0.00141627 hartree
thermaltotal: -4333.56677828 hartree
thermalcorr: 0.05359646 hartree
nonthermalcorr: 0.91359389 hartree
totalcorr: 0.96719035 hartree
thermalcorrenthalpy: 0.00094421 hartree
totalenthalpy: -4333.56583407 hartree
vibrat: 0.09066438 hartree
rotat: 0.01813050 hartree
transl: 0.02168105 hartree
total: 0.13178485 hartree
totalentropycorr: -0.13178485 hartree
gibbsenthalpy: -4333.69761892 hartree
gibbsminuselec: 0.83634971 hartree
