program: Orca
programVersion: 5.0.4
elementType: Fe P P P Cl N C C H C H C C H C C H H H C C H C H C C H C C H H H C C H C H C C H C C H H H C H C H H H C H H H C H C H H H C H H H C H C H H H C H H H C H C H H H C H H H C H C H H H C H H H C H C H H H C H H H
keywords: PBE0 D4 DKH2 RIJCOSX DKH-def2-SV(P) def2-tzvp/c damp Opt Freq UNO UCO NormalPrint CPCM(acetonitrile)
charge: -1
multiplicity: 3
frequency: 0.00 0.00 0.00 0.00 0.00 0.00 -13.88 26.56 35.92 37.28 42.82 50.66 52.33 60.94 67.85 70.15 73.71 77.31 79.63 85.44 88.01 91.62 93.99 101.87 104.06 107.05 111.72 116.86 122.01 126.70 127.91 130.00 135.47 140.78 145.37 149.43 157.28 160.86 179.18 182.66 184.33 193.71 197.25 203.45 205.47 216.29 221.55 226.46 229.16 233.02 239.57 242.76 245.52 249.48 250.50 254.50 257.35 258.18 259.74 263.12 266.68 267.05 273.53 280.18 297.00 300.45 308.90 317.69 325.78 332.34 338.94 345.55 353.11 360.55 363.43 367.80 373.86 382.86 396.11 406.61 409.78 414.12 424.07 439.93 447.62 460.74 469.74 474.92 479.03 492.35 495.05 498.70 517.37 530.62 548.69 553.91 575.88 584.47 590.46 598.20 600.27 611.70 625.09 647.87 662.74 667.08 670.61 674.99 692.76 698.37 705.72 753.05 759.19 812.56 827.02 830.77 854.52 862.06 872.58 889.61 891.26 898.41 907.21 916.15 917.97 922.45 923.65 926.02 927.13 931.90 935.02 937.79 940.06 941.93 948.08 949.22 951.21 967.81 978.64 979.82 980.66 982.51 987.23 990.58 1005.45 1017.53 1019.50 1037.62 1043.72 1044.04 1053.19 1061.19 1061.40 1061.48 1069.07 1077.82 1079.15 1091.58 1096.10 1102.61 1136.38 1140.37 1145.60 1145.95 1147.61 1151.66 1156.83 1158.18 1188.75 1190.16 1190.99 1191.93 1195.40 1195.77 1202.00 1233.58 1243.02 1251.49 1260.67 1274.08 1275.16 1281.05 1282.69 1287.52 1290.79 1292.95 1306.23 1316.17 1326.73 1337.36 1339.30 1340.09 1340.82 1343.58 1349.41 1353.13 1385.61 1393.46 1395.14 1396.62 1399.25 1399.37 1402.11 1403.25 1404.33 1404.95 1406.96 1410.70 1411.40 1411.96 1412.35 1412.55 1417.47 1419.63 1424.07 1433.49 1437.26 1463.84 1472.90 1474.22 1474.28 1475.48 1477.30 1477.90 1480.59 1480.86 1481.64 1482.24 1483.47 1483.98 1484.51 1485.47 1486.10 1486.97 1487.58 1488.55 1491.44 1491.79 1493.16 1495.73 1499.79 1500.30 1502.15 1505.75 1507.17 1509.11 1515.58 1522.90 1533.69 1553.85 1594.04 1611.28 1633.21 1659.70 1675.72 3021.58 3032.91 3038.73 3040.60 3040.93 3042.56 3045.46 3046.98 3047.58 3049.84 3049.92 3051.54 3054.67 3056.97 3060.89 3068.35 3071.90 3078.21 3088.14 3104.07 3106.55 3108.62 3119.50 3121.60 3124.07 3124.16 3126.65 3127.41 3128.36 3128.77 3129.23 3135.27 3135.85 3136.15 3136.43 3140.09 3142.11 3147.84 3150.37 3152.42 3154.49 3156.99 3161.50 3163.46 3168.64 3169.95 3171.95 3173.07 3175.40 3180.53 3181.34 3185.55 3198.63 3199.40 3200.05 3201.32 3213.27 3221.84 3227.19 3259.45
frequency: 26.56 35.92 37.28 42.82 50.66 52.33 60.94 67.85 70.15 73.71 77.31 79.63 85.44 88.01 91.62 93.99 101.87 104.06 107.05 111.72 116.86 122.01 126.70 127.91 130.00 135.47 140.78 145.37 149.43 157.28 160.86 179.18 182.66 184.33 193.71 197.25 203.45 205.47 216.29 221.55 226.46 229.16 233.02 239.57 242.76 245.52 249.48 250.50 254.50 257.35 258.18 259.74 263.12 266.68 267.05 273.53 280.18 297.00 300.45 308.90 317.69 325.78 332.34 338.94 345.55 353.11 360.55 363.43 367.80 373.86 382.86 396.11 406.61 409.78 414.12 424.07 439.93 447.62 460.74 469.74 474.92 479.03 492.35 495.05 498.70 517.37 530.62 548.69 553.91 575.88 584.47 590.46 598.20 600.27 611.70 625.09 647.87 662.74 667.08 670.61 674.99 692.76 698.37 705.72 753.05 759.19 812.56 827.02 830.77 854.52 862.06 872.58 889.61 891.26 898.41 907.21 916.15 917.97 922.45 923.65 926.02 927.13 931.90 935.02 937.79 940.06 941.93 948.08 949.22 951.21 967.81 978.64 979.82 980.66 982.51 987.23 990.58 1005.45 1017.53 1019.50 1037.62 1043.72 1044.04 1053.19 1061.19 1061.40 1061.48 1069.07 1077.82 1079.15 1091.58 1096.10 1102.61 1136.38 1140.37 1145.60 1145.95 1147.61 1151.66 1156.83 1158.18 1188.75 1190.16 1190.99 1191.93 1195.40 1195.77 1202.00 1233.58 1243.02 1251.49 1260.67 1274.08 1275.16 1281.05 1282.69 1287.52 1290.79 1292.95 1306.23 1316.17 1326.73 1337.36 1339.30 1340.09 1340.82 1343.58 1349.41 1353.13 1385.61 1393.46 1395.14 1396.62 1399.25 1399.37 1402.11 1403.25 1404.33 1404.95 1406.96 1410.70 1411.40 1411.96 1412.35 1412.55 1417.47 1419.63 1424.07 1433.49 1437.26 1463.84 1472.90 1474.22 1474.28 1475.48 1477.30 1477.90 1480.59 1480.86 1481.64 1482.24 1483.47 1483.98 1484.51 1485.47 1486.10 1486.97 1487.58 1488.55 1491.44 1491.79 1493.16 1495.73 1499.79 1500.30 1502.15 1505.75 1507.17 1509.11 1515.58 1522.90 1533.69 1553.85 1594.04 1611.28 1633.21 1659.70 1675.72 3021.58 3032.91 3038.73 3040.60 3040.93 3042.56 3045.46 3046.98 3047.58 3049.84 3049.92 3051.54 3054.67 3056.97 3060.89 3068.35 3071.90 3078.21 3088.14 3104.07 3106.55 3108.62 3119.50 3121.60 3124.07 3124.16 3126.65 3127.41 3128.36 3128.77 3129.23 3135.27 3135.85 3136.15 3136.43 3140.09 3142.11 3147.84 3150.37 3152.42 3154.49 3156.99 3161.50 3163.46 3168.64 3169.95 3171.95 3173.07 3175.40 3180.53 3181.34 3185.55 3198.63 3199.40 3200.05 3201.32 3213.27 3221.84 3227.19 3259.45
formula: C39H60ClFeNP3
InChI: InChI=1/C39H60NP3.ClH.Fe/c1-25(2)41(26(3)4)37-22-31(13)16-19-34(37)40(35-20-17-32(14)23-38(35)42(27(5)6)28(7)8)36-21-18-33(15)24-39(36)43(29(9)10)30(11)12;;/h16-30H,1-15H3;1H;/q;;+1/p-1/rC39H60ClFeNP3/c1-25(2)43(26(3)4)37-22-31(13)16-19-34(37)42-35-20-17-32(14)23-38(35)44(27(5)6,28(7)8)41(43,40)45(29(9)10,30(11)12)39-24-33(15)18-21-36(39)42/h16-30H,1-15H3
105 atoms
Fe 0.011099 -0.004592 -0.004545
P  -0.6976 -2.177944 -0.665889
P  -1.613077 1.588242 -0.658898
P  2.019868 0.556296 -1.117166
Cl 0.120042 -0.047307 2.388099
N  -0.384632 -0.108258 -2.85992
C  0.186461 -1.358898 -3.197057
C  0.882697 -1.506712 -4.400356
H  0.986133 -0.64783 -5.061689
C  1.437135 -2.742024 -4.755352
H  1.986575 -2.836812 -5.69363
C  1.27576 -3.8562 -3.933265
C  0.558614 -3.696048 -2.734573
H  0.436218 -4.568277 -2.092724
C  0.032054 -2.461575 -2.333388
C  1.86595 -5.192379 -4.291161
H  2.213875 -5.210559 -5.332354
H  1.133911 -6.002604 -4.161667
H  2.727325 -5.433828 -3.649103
C  -1.8074 -0.02486 -2.94078
C  -2.508764 -0.802262 -3.847337
H  -1.956437 -1.50051 -4.47827
C  -3.915176 -0.702701 -3.966885
H  -4.457977 -1.342229 -4.664365
C  -4.601445 0.289551 -3.209841
C  -3.88853 1.087299 -2.332001
H  -4.439243 1.841646 -1.766356
C  -2.473735 0.940832 -2.112011
C  -6.087314 0.457829 -3.376907
H  -6.355909 0.699486 -4.418573
H  -6.47986 1.25847 -2.734818
H  -6.627412 -0.469896 -3.12561
C  0.316981 1.051106 -3.290256
C  -0.222186 1.838136 -4.315344
H  -1.15069 1.51331 -4.783285
C  0.398623 3.017388 -4.71563
H  -0.049901 3.624042 -5.504342
C  1.585995 3.435109 -4.104242
C  2.118096 2.633241 -3.088541
H  3.027792 2.979927 -2.606461
C  1.505001 1.448724 -2.650805
C  2.275543 4.702569 -4.528075
H  2.986105 5.046356 -3.764989
H  1.553629 5.51024 -4.7121
H  2.840122 4.555961 -5.46213
C  -0.013596 -3.620287 0.325298
H  -0.305996 -4.556267 -0.175424
C  1.50818 -3.529472 0.391605
H  1.803517 -2.641495 0.967108
H  1.982583 -3.46408 -0.594858
H  1.91592 -4.413185 0.906685
C  -0.556657 -3.640194 1.756671
H  0.007918 -4.378597 2.347415
H  -1.612256 -3.919835 1.812433
H  -0.432167 -2.657656 2.234596
C  -2.508225 -2.625359 -0.97152
H  -2.862346 -1.716157 -1.476114
C  -2.71397 -3.797662 -1.922364
H  -2.307027 -4.734238 -1.510947
H  -2.243572 -3.617562 -2.896442
H  -3.791459 -3.952374 -2.094206
C  -3.340943 -2.816544 0.295133
H  -4.402696 -2.642338 0.063179
H  -3.06203 -2.129128 1.102184
H  -3.259704 -3.842601 0.678395
C  -2.999339 1.922521 0.561954
H  -3.753245 2.540512 0.051216
C  -3.643151 0.605045 0.97407
H  -2.913877 -0.018451 1.509159
H  -4.008745 0.040406 0.106734
H  -4.495489 0.785669 1.648827
C  -2.518994 2.679703 1.79864
H  -3.330097 2.729016 2.542726
H  -2.223865 3.710356 1.571668
H  -1.665128 2.167549 2.265445
C  -1.052572 3.323315 -1.15512
H  -0.464608 3.091342 -2.052496
C  -2.184476 4.251598 -1.575321
H  -2.800645 4.561926 -0.717978
H  -2.842867 3.764257 -2.308633
H  -1.785533 5.168158 -2.039975
C  -0.100117 3.973275 -0.153479
H  0.538472 4.715956 -0.656718
H  0.559515 3.229071 0.31576
H  -0.631891 4.497873 0.65094
C  3.121823 1.830842 -0.263468
H  2.546111 2.756723 -0.415032
C  4.543249 2.071464 -0.77593
H  4.952386 2.971337 -0.290317
H  4.611854 2.223975 -1.858374
H  5.210523 1.239325 -0.520846
C  3.159141 1.564282 1.241807
H  3.734242 0.65623 1.474398
H  2.15448 1.427401 1.662723
H  3.649475 2.404775 1.757908
C  3.167426 -0.803124 -1.748833
H  2.443713 -1.583494 -2.021893
C  3.983443 -0.482487 -2.995575
H  4.766765 0.261292 -2.801979
H  3.348536 -0.107515 -3.808337
H  4.479941 -1.397419 -3.35649
C  4.039894 -1.364021 -0.626897
H  4.438704 -2.347374 -0.919193
H  3.478896 -1.50008 0.305836
H  4.897653 -0.715601 -0.409776
elementType: Fe P Cl N C H
totalener: -4334.38680599 hartree
nucrepener: 8741.55907990 hartree
cpcmener: -0.07402583 hartree
kineticenergy: 4407.33714991 hartree
exchangeener: -285.062688556830 hartree
correlationener: -13.658831033683 hartree
xcener: -298.721519590513 hartree
s2: 3.032240
dispersion: -0.189914682 hartree
s2: 3.036625
dispersion: -0.190486092 hartree
s2: 3.042998
dispersion: -0.188864169 hartree
s2: 3.043888
dispersion: -0.188935094 hartree
s2: 3.042655
dispersion: -0.189958894 hartree
s2: 3.042722
dispersion: -0.189068467 hartree
s2: 3.043780
dispersion: -0.188632206 hartree
s2: 3.043855
dispersion: -0.188723469 hartree
s2: 3.043321
dispersion: -0.189214379 hartree
s2: 3.043622
dispersion: -0.188791200 hartree
s2: 3.043544
dispersion: -0.188681835 hartree
s2: 3.044277
dispersion: -0.188604999 hartree
s2: 3.044363
dispersion: -0.188485317 hartree
s2: 3.044578
dispersion: -0.188437410 hartree
s2: 3.044878
dispersion: -0.188202325 hartree
s2: 3.044696
dispersion: -0.188256827 hartree
s2: 3.044568
dispersion: -0.188278719 hartree
s2: 3.044411
dispersion: -0.188288294 hartree
s2: 3.044444
dispersion: -0.188356925 hartree
s2: 3.044283
dispersion: -0.188396426 hartree
s2: 3.044237
dispersion: -0.188451911 hartree
s2: 3.044127
dispersion: -0.188479033 hartree
s2: 3.044018
dispersion: -0.188476351 hartree
s2: 3.043961
chargesum: -1.0000000
charge: -0.052868 0.455025 0.419177 0.461012 -0.472876 -0.361056 0.115729 -0.209511 0.166937 -0.250119 0.157801 0.060892 -0.320155 0.160857 -0.103348 -0.486351 0.181512 0.184780 0.188646 0.074397 -0.211153 0.143768 -0.347698 0.117961 0.064687 -0.356291 0.130211 -0.163795 -0.493017 0.166686 0.169118 0.167386 0.088075 -0.183316 0.167755 -0.241107 0.162009 0.063709 -0.319627 0.164766 -0.089381 -0.487213 0.184935 0.185629 0.191799 -0.417899 0.200563 -0.510258 0.190434 0.202878 0.174366 -0.478206 0.168310 0.175458 0.162054 -0.442610 0.260982 -0.462799 0.169355 0.187765 0.164059 -0.481422 0.173765 0.190918 0.182759 -0.408961 0.191234 -0.503550 0.176563 0.196124 0.165018 -0.471666 0.163880 0.178342 0.154520 -0.424310 0.237062 -0.468229 0.169703 0.172503 0.164010 -0.490589 0.166244 0.201495 0.169945 -0.465772 0.214921 -0.477763 0.174622 0.198771 0.182778 -0.481981 0.168660 0.186296 0.167427 -0.449605 0.247836 -0.452456 0.172105 0.185108 0.165698 -0.485328 0.176618 0.195322 0.180554
charge: -1.488560 0.833782 0.818816 0.834925 -0.146878 0.008619 0.008934 -0.186027 0.152522 -0.165070 0.148429 -0.072569 -0.169526 0.146033 -0.167021 -0.387441 0.147341 0.150704 0.153179 -0.022823 -0.201004 0.138657 -0.288983 0.127508 -0.094194 -0.212249 0.129118 -0.292704 -0.389638 0.139232 0.138865 0.140014 0.006253 -0.166186 0.155894 -0.159234 0.150680 -0.068533 -0.163723 0.148733 -0.166509 -0.387027 0.148796 0.151475 0.155196 -0.290946 0.139675 -0.396782 0.141922 0.138609 0.140172 -0.407764 0.137892 0.138027 0.130244 -0.294633 0.161815 -0.397424 0.133979 0.138933 0.135970 -0.396647 0.140137 0.138131 0.136024 -0.290477 0.135836 -0.398658 0.137197 0.138824 0.134408 -0.403028 0.135636 0.134685 0.130221 -0.305952 0.153586 -0.400320 0.133935 0.137106 0.134610 -0.398423 0.135578 0.141047 0.133527 -0.296842 0.148793 -0.400692 0.143151 0.137330 0.138647 -0.403846 0.136232 0.139079 0.137043 -0.293392 0.154815 -0.398571 0.136490 0.138356 0.138166 -0.396919 0.141661 0.139955 0.136067
qa: -0.0529 0.4550 0.4192 0.4610 -0.4729 -0.3611 0.1157 -0.2095 0.1669 -0.2501 0.1578 0.0609 -0.3202 0.1609 -0.1033 -0.4864 0.1815 0.1848 0.1886 0.0744 -0.2112 0.1438 -0.3477 0.1180 0.0647 -0.3563 0.1302 -0.1638 -0.4930 0.1667 0.1691 0.1674 0.0881 -0.1833 0.1678 -0.2411 0.1620 0.0637 -0.3196 0.1648 -0.0894 -0.4872 0.1849 0.1856 0.1918 -0.4179 0.2006 -0.5103 0.1904 0.2029 0.1744 -0.4782 0.1683 0.1755 0.1621 -0.4426 0.2610 -0.4628 0.1694 0.1878 0.1641 -0.4814 0.1738 0.1909 0.1828 -0.4090 0.1912 -0.5035 0.1766 0.1961 0.1650 -0.4717 0.1639 0.1783 0.1545 -0.4243 0.2371 -0.4682 0.1697 0.1725 0.1640 -0.4906 0.1662 0.2015 0.1699 -0.4658 0.2149 -0.4778 0.1746 0.1988 0.1828 -0.4820 0.1687 0.1863 0.1674 -0.4496 0.2478 -0.4525 0.1721 0.1851 0.1657 -0.4853 0.1766 0.1953 0.1806
va: 5.5478 3.6968 3.7830 3.6863 0.9853 3.1020 4.0234 3.7837 0.9463 3.8328 0.9450 3.8919 3.8579 0.9471 3.8326 3.8224 0.9349 0.9278 0.9239 3.9617 3.8032 0.9486 3.7509 0.9509 3.8916 3.8950 0.9537 3.7391 3.8302 0.9292 0.9384 0.9291 4.0202 3.8015 0.9506 3.8008 0.9426 3.8955 3.8856 0.9505 3.8116 3.8214 0.9336 0.9290 0.9230 3.9144 0.9099 3.7838 0.9511 0.9308 0.9315 3.7768 0.9341 0.9418 1.0061 3.9090 0.8778 3.8066 0.9365 0.9374 0.9384 3.8108 0.9307 0.9343 0.9276 3.9245 0.9134 3.7869 0.9717 0.9367 0.9325 3.7807 0.9348 0.9368 0.9978 3.8747 0.8787 3.8223 0.9349 0.9455 0.9312 3.8073 0.9314 0.9358 0.9384 3.9141 0.9065 3.7922 0.9310 0.9258 0.9387 3.7829 0.9402 0.9924 0.9325 3.9140 0.8755 3.8004 0.9399 0.9378 0.9357 3.7998 0.9303 0.9343 0.9374
dispersion: -0.188461148 hartree
energy: -4334.584714207991 hartree
dipole: 3.45750 -0.58368 2.87383 -0.13164 -0.10336 -0.23500 -5.91911 3.44499 -2.47412
magnitude: 3.79940 au
magnitude: 9.65729 debye
temp: 298.15 k
press: 1.00 atm
zeropoint: 0.90727686 hartree
thermalvibcorrection: 0.05128818 hartree
thermalrotcorrection: 0.00141627 hartree
thermaltrasncorrection: 0.00141627 hartree
thermaltotal: -4333.62331662 hartree
thermalcorr: 0.05412072 hartree
nonthermalcorr: 0.90727686 hartree
totalcorr: 0.96139759 hartree
thermalcorrenthalpy: 0.00094421 hartree
totalenthalpy: -4333.62237241 hartree
vibrat: 0.09119444 hartree
rotat: 0.01813322 hartree
transl: 0.02168105 hartree
total: 0.13204601 hartree
totalentropycorr: -0.13204601 hartree
gibbsenthalpy: -4333.75441842 hartree
gibbsminuselec: 0.83029579 hartree
