program: Orca
programVersion: 5.0
elementType: Fe P P P N C C H C H C C H C C H H H C C H C H C C H C C H H H C C H C H C C H C C H H H C H C H H H C H H H C H C H H H C H H H C H C H H H C H H H C H C H H H C H H H C H C H H H C H H H C H C H H H C H H H C N C H H H Cl
keywords: PBE0 D4 DKH2 DKH-def2-SV(P) def2-tzvp/c Opt Freq UNO UCO NormalPrint CPCM(acetonitrile)
charge: 1
multiplicity: 5
frequency: 0.00 0.00 0.00 0.00 0.00 0.00 -36.02 -11.58 12.34 26.49 26.89 34.86 35.42 37.18 45.76 46.45 53.75 59.23 63.63 64.81 73.45 74.92 77.81 84.19 87.78 91.32 92.80 100.38 105.36 109.52 111.78 112.20 118.03 124.32 127.50 132.47 142.00 145.47 148.50 149.12 152.56 157.60 168.70 173.13 175.60 177.62 185.50 195.28 200.64 205.99 210.11 213.42 220.56 222.38 227.18 233.26 236.22 238.06 243.82 248.90 249.25 254.38 255.06 260.50 262.16 265.67 270.07 276.10 280.57 284.46 295.60 299.50 310.42 321.46 327.18 332.20 344.04 349.16 353.94 366.47 370.81 381.29 385.17 391.52 401.12 407.91 414.05 415.29 422.72 433.28 445.75 450.42 469.72 472.94 475.94 485.37 491.01 494.69 504.28 511.34 526.44 544.54 551.33 560.54 587.18 588.85 592.97 615.74 623.60 631.64 668.09 683.87 686.56 688.52 700.30 700.95 706.47 770.83 771.83 774.64 838.41 842.74 856.26 882.90 886.38 909.49 911.53 918.08 919.29 920.31 920.49 924.00 925.59 926.27 930.07 941.61 942.22 947.06 947.82 950.64 951.70 953.12 957.20 983.10 983.94 984.87 986.97 991.63 992.57 995.22 995.75 998.56 999.71 1024.15 1025.26 1027.05 1049.53 1050.64 1051.12 1051.25 1065.37 1065.63 1065.75 1066.87 1072.66 1075.43 1083.83 1089.54 1105.84 1106.50 1145.95 1146.75 1146.98 1149.85 1152.31 1153.20 1178.37 1178.92 1179.94 1187.78 1192.91 1193.78 1194.80 1195.50 1197.30 1226.39 1258.89 1260.11 1266.17 1282.17 1284.44 1286.15 1292.75 1295.00 1297.27 1298.24 1310.31 1314.09 1321.08 1321.75 1334.21 1336.63 1343.84 1344.54 1348.30 1350.49 1376.70 1381.79 1390.17 1390.86 1406.10 1407.15 1408.45 1409.66 1410.72 1411.75 1413.62 1414.45 1415.25 1418.45 1420.60 1421.72 1425.15 1426.62 1427.38 1431.07 1441.64 1442.22 1443.28 1445.91 1471.37 1471.93 1474.91 1475.92 1477.44 1478.43 1479.05 1480.87 1481.84 1482.85 1483.80 1484.21 1485.34 1486.29 1487.18 1487.80 1488.70 1489.78 1490.30 1491.70 1493.79 1494.75 1496.59 1496.84 1500.20 1503.63 1504.78 1508.87 1510.67 1517.31 1540.52 1541.56 1549.39 1647.18 1652.58 1653.62 1688.05 1688.32 1691.46 2415.05 2962.97 3055.52 3056.15 3057.87 3058.54 3059.81 3060.12 3060.65 3063.79 3065.44 3065.46 3066.74 3068.91 3071.98 3072.43 3075.92 3091.48 3092.52 3092.61 3107.79 3122.21 3130.96 3133.84 3140.65 3140.84 3140.93 3141.14 3141.84 3143.91 3144.89 3147.96 3150.70 3150.84 3151.70 3153.60 3156.99 3158.21 3160.20 3162.74 3167.51 3168.51 3168.79 3170.19 3170.88 3173.24 3173.26 3175.18 3178.07 3181.54 3182.95 3184.49 3186.99 3190.52 3200.61 3217.58 3218.13 3218.71 3228.19 3228.32 3238.40 3239.92 3240.51 3258.29
frequency: 12.34 26.49 26.89 34.86 35.42 37.18 45.76 46.45 53.75 59.23 63.63 64.81 73.45 74.92 77.81 84.19 87.78 91.32 92.80 100.38 105.36 109.52 111.78 112.20 118.03 124.32 127.50 132.47 142.00 145.47 148.50 149.12 152.56 157.60 168.70 173.13 175.60 177.62 185.50 195.28 200.64 205.99 210.11 213.42 220.56 222.38 227.18 233.26 236.22 238.06 243.82 248.90 249.25 254.38 255.06 260.50 262.16 265.67 270.07 276.10 280.57 284.46 295.60 299.50 310.42 321.46 327.18 332.20 344.04 349.16 353.94 366.47 370.81 381.29 385.17 391.52 401.12 407.91 414.05 415.29 422.72 433.28 445.75 450.42 469.72 472.94 475.94 485.37 491.01 494.69 504.28 511.34 526.44 544.54 551.33 560.54 587.18 588.85 592.97 615.74 623.60 631.64 668.09 683.87 686.56 688.52 700.30 700.95 706.47 770.83 771.83 774.64 838.41 842.74 856.26 882.90 886.38 909.49 911.53 918.08 919.29 920.31 920.49 924.00 925.59 926.27 930.07 941.61 942.22 947.06 947.82 950.64 951.70 953.12 957.20 983.10 983.94 984.87 986.97 991.63 992.57 995.22 995.75 998.56 999.71 1024.15 1025.26 1027.05 1049.53 1050.64 1051.12 1051.25 1065.37 1065.63 1065.75 1066.87 1072.66 1075.43 1083.83 1089.54 1105.84 1106.50 1145.95 1146.75 1146.98 1149.85 1152.31 1153.20 1178.37 1178.92 1179.94 1187.78 1192.91 1193.78 1194.80 1195.50 1197.30 1226.39 1258.89 1260.11 1266.17 1282.17 1284.44 1286.15 1292.75 1295.00 1297.27 1298.24 1310.31 1314.09 1321.08 1321.75 1334.21 1336.63 1343.84 1344.54 1348.30 1350.49 1376.70 1381.79 1390.17 1390.86 1406.10 1407.15 1408.45 1409.66 1410.72 1411.75 1413.62 1414.45 1415.25 1418.45 1420.60 1421.72 1425.15 1426.62 1427.38 1431.07 1441.64 1442.22 1443.28 1445.91 1471.37 1471.93 1474.91 1475.92 1477.44 1478.43 1479.05 1480.87 1481.84 1482.85 1483.80 1484.21 1485.34 1486.29 1487.18 1487.80 1488.70 1489.78 1490.30 1491.70 1493.79 1494.75 1496.59 1496.84 1500.20 1503.63 1504.78 1508.87 1510.67 1517.31 1540.52 1541.56 1549.39 1647.18 1652.58 1653.62 1688.05 1688.32 1691.46 2415.05 2962.97 3055.52 3056.15 3057.87 3058.54 3059.81 3060.12 3060.65 3063.79 3065.44 3065.46 3066.74 3068.91 3071.98 3072.43 3075.92 3091.48 3092.52 3092.61 3107.79 3122.21 3130.96 3133.84 3140.65 3140.84 3140.93 3141.14 3141.84 3143.91 3144.89 3147.96 3150.70 3150.84 3151.70 3153.60 3156.99 3158.21 3160.20 3162.74 3167.51 3168.51 3168.79 3170.19 3170.88 3173.24 3173.26 3175.18 3178.07 3181.54 3182.95 3184.49 3186.99 3190.52 3200.61 3217.58 3218.13 3218.71 3228.19 3228.32 3238.40 3239.92 3240.51 3258.29
formula: C41H63ClFeN2P3
InChI: InChI=1/C39H60NP3.C2H3N.Cl.Fe/c1-25(2)41(26(3)4)37-22-31(13)16-19-34(37)40(35-20-17-32(14)23-38(35)42(27(5)6)28(7)8)36-21-18-33(15)24-39(36)43(29(9)10)30(11)12;1-2-3;;/h16-30H,1-15H3;1H3;;/rC39H60NP3.C2H3FeN.Cl/c1-25(2)41(26(3)4)37-22-31(13)16-19-34(37)40(35-20-17-32(14)23-38(35)42(27(5)6)28(7)8)36-21-18-33(15)24-39(36)43(29(9)10)30(11)12;1-2-4-3;/h16-30H,1-15H3;1H3;
111 atoms
Fe -0.298373 1.426571 2.666121
P  -1.073676 -0.792474 1.941655
P  -1.941493 3.165642 2.150186
P  1.892846 2.138667 1.807518
N  -0.496771 1.530316 0.035352
C  0.082338 0.284361 -0.384825
C  0.873307 0.224737 -1.534346
H  1.06076 1.131249 -2.106698
C  1.422618 -0.981886 -1.954942
H  2.041598 -1.001266 -2.852451
C  1.177334 -2.167452 -1.254551
C  0.373608 -2.094887 -0.112611
H  0.180726 -3.016679 0.434576
C  -0.164706 -0.889875 0.350863
C  1.777123 -3.473414 -1.68916
H  1.968565 -3.485171 -2.769726
H  1.12024 -4.317229 -1.441514
H  2.738883 -3.647431 -1.182608
C  -1.912609 1.639336 -0.194401
C  -2.507304 0.97209 -1.267578
H  -1.897628 0.346168 -1.916912
C  -3.870636 1.096853 -1.50786
H  -4.315857 0.556701 -2.34414
C  -4.672899 1.913658 -0.701905
C  -4.061681 2.58461 0.361801
H  -4.686067 3.209966 0.998827
C  -2.697185 2.450653 0.644254
C  -6.143705 2.054424 -0.968272
H  -6.325195 2.452989 -1.976821
H  -6.619142 2.728071 -0.244906
H  -6.64931 1.079833 -0.91086
C  0.237142 2.699312 -0.371288
C  -0.215185 3.476879 -1.441372
H  -1.116657 3.184027 -1.976249
C  0.460183 4.633028 -1.813507
H  0.07921 5.22875 -2.64355
C  1.615185 5.040314 -1.135373
C  2.066405 4.24275 -0.080526
H  2.955221 4.566964 0.454415
C  1.400301 3.077963 0.319577
C  2.348613 6.288538 -1.532804
H  3.121165 6.549083 -0.798903
H  1.660756 7.139953 -1.627564
H  2.840191 6.159287 -2.508569
C  -0.407086 -2.232167 2.919669
H  -0.553125 -3.136104 2.310673
C  1.084951 -2.00993 3.153042
H  1.248186 -1.126218 3.786334
H  1.650873 -1.879729 2.223103
H  1.507095 -2.876485 3.681925
C  -1.119996 -2.434368 4.256691
H  -0.515768 -3.114111 4.875214
H  -2.106733 -2.891554 4.142164
H  -1.256106 -1.503271 4.822762
C  -2.863557 -1.114162 1.494777
H  -3.179797 -0.146282 1.084084
C  -3.00922 -2.174689 0.408911
H  -2.618213 -3.147784 0.740545
H  -2.496397 -1.895546 -0.519704
H  -4.076487 -2.306498 0.176349
C  -3.758709 -1.432529 2.693339
H  -4.799482 -1.207021 2.419918
H  -3.521724 -0.866191 3.602642
H  -3.713941 -2.500227 2.942367
C  -3.357112 3.380421 3.331979
H  -4.105312 4.003794 2.821082
C  -3.971901 2.025995 3.669056
H  -3.309085 1.428008 4.309761
H  -4.224283 1.438938 2.777887
H  -4.899814 2.181091 4.239001
C  -2.917945 4.106822 4.603639
H  -3.727467 4.047208 5.345308
H  -2.711932 5.168541 4.42942
H  -2.024696 3.648888 5.051538
C  -1.355031 4.862975 1.648309
H  -0.717036 4.642062 0.783659
C  -2.487616 5.768242 1.179036
H  -3.166922 6.03434 2.000914
H  -3.077264 5.30442 0.376597
H  -2.064364 6.703321 0.783329
C  -0.477993 5.521536 2.711732
H  0.115087 6.321518 2.246269
H  0.220134 4.813172 3.175983
H  -1.073286 5.975277 3.512561
C  2.844553 3.364403 2.853038
H  2.294278 4.299086 2.667298
C  4.313042 3.59946 2.498741
H  4.676362 4.456196 3.08485
H  4.48501 3.829522 1.441773
H  4.93936 2.738687 2.759629
C  2.693548 3.028095 4.336672
H  3.111791 2.042221 4.580696
H  1.643774 3.043171 4.650942
H  3.23357 3.776714 4.934341
C  3.024378 0.766671 1.226942
H  2.310902 0.020736 0.85022
C  3.944757 1.14707 0.07338
H  4.707192 1.876553 0.372371
H  3.385699 1.56108 -0.775344
H  4.465516 0.244443 -0.279276
C  3.775241 0.135174 2.398513
H  4.192541 -0.830257 2.078863
H  3.125174 -0.054103 3.261559
H  4.611338 0.758925 2.736063
C  -0.257012 1.194778 5.844367
N  -0.255493 1.319842 4.695325
C  -0.287445 1.018933 7.270945
H  -0.176072 1.989138 7.77251
H  0.523468 0.346089 7.57979
H  -1.273927 0.566825 7.497766
Cl -3.30167 -0.310655 6.595737
elementType: Fe P N C H Cl
totalener: -4466.76716424 hartree
nucrepener: 9366.19733250 hartree
cpcmener: -0.13289732 hartree
kineticenergy: 4539.99961887 hartree
exchangeener: -298.173860095796 hartree
correlationener: -14.268624112532 hartree
xcener: -312.442484208328 hartree
s2: 6.021109
dispersion: -0.188909852 hartree
s2: 6.021048
dispersion: -0.189005511 hartree
s2: 6.020994
dispersion: -0.188775908 hartree
s2: 6.020946
dispersion: -0.188913252 hartree
s2: 6.020897
dispersion: -0.188909015 hartree
s2: 6.020878
dispersion: -0.188997821 hartree
s2: 6.020860
dispersion: -0.189156819 hartree
s2: 6.020833
dispersion: -0.189186465 hartree
s2: 6.020836
dispersion: -0.189197056 hartree
s2: 6.020831
dispersion: -0.189215953 hartree
s2: 6.020827
dispersion: -0.189327663 hartree
s2: 6.020873
dispersion: -0.189410729 hartree
s2: 6.020942
dispersion: -0.189273782 hartree
s2: 6.021029
dispersion: -0.189339537 hartree
s2: 6.021019
dispersion: -0.189517005 hartree
s2: 6.020962
dispersion: -0.189532945 hartree
s2: 6.020995
dispersion: -0.189366571 hartree
s2: 6.021033
dispersion: -0.189761279 hartree
s2: 6.021004
dispersion: -0.189615043 hartree
s2: 6.020953
dispersion: -0.189461512 hartree
s2: 6.020929
dispersion: -0.189463341 hartree
s2: 6.020893
dispersion: -0.189566923 hartree
s2: 6.020851
dispersion: -0.189432597 hartree
s2: 6.020869
dispersion: -0.189451801 hartree
s2: 6.020877
dispersion: -0.189472711 hartree
s2: 6.020903
dispersion: -0.189501937 hartree
s2: 6.020948
dispersion: -0.189512186 hartree
dispersion: -0.189558568 hartree
s2: 6.021140
dispersion: -0.189548921 hartree
s2: 6.021279
dispersion: -0.189591279 hartree
s2: 6.021302
dispersion: -0.189591106 hartree
s2: 6.021395
dispersion: -0.189649797 hartree
s2: 6.021500
dispersion: -0.189691636 hartree
s2: 6.021589
dispersion: -0.189733091 hartree
s2: 6.021693
dispersion: -0.189795403 hartree
s2: 6.021760
dispersion: -0.189815391 hartree
s2: 6.021747
dispersion: -0.189692404 hartree
s2: 6.021591
dispersion: -0.189483933 hartree
s2: 6.021612
dispersion: -0.189457003 hartree
s2: 6.021557
dispersion: -0.189410720 hartree
s2: 6.021505
dispersion: -0.189365383 hartree
s2: 6.021266
dispersion: -0.189248198 hartree
s2: 6.021252
dispersion: -0.189209416 hartree
s2: 6.021119
dispersion: -0.189134860 hartree
s2: 6.021025
dispersion: -0.189083515 hartree
s2: 6.020909
dispersion: -0.189062779 hartree
s2: 6.020863
dispersion: -0.189075830 hartree
s2: 6.020865
dispersion: -0.189054706 hartree
s2: 6.020889
dispersion: -0.189049816 hartree
s2: 6.020829
dispersion: -0.189021837 hartree
s2: 6.020864
dispersion: -0.188952072 hartree
s2: 6.020879
dispersion: -0.188901761 hartree
s2: 6.020885
dispersion: -0.189028439 hartree
s2: 6.020906
dispersion: -0.189040775 hartree
s2: 6.020924
dispersion: -0.188953815 hartree
s2: 6.020932
dispersion: -0.188932549 hartree
dispersion: -0.189088184 hartree
s2: 6.020970
dispersion: -0.189113279 hartree
s2: 6.020952
dispersion: -0.188921639 hartree
s2: 6.020972
dispersion: -0.189184196 hartree
s2: 6.020975
dispersion: -0.189060698 hartree
s2: 6.020978
dispersion: -0.188955639 hartree
s2: 6.020977
dispersion: -0.189036164 hartree
s2: 6.020992
dispersion: -0.189040859 hartree
s2: 6.020991
dispersion: -0.189048414 hartree
s2: 6.020998
dispersion: -0.189038488 hartree
s2: 6.021011
chargesum: 1.0000000
charge: 0.430978 0.419595 0.428402 0.432063 -0.414127 0.089045 -0.174413 0.204132 -0.203993 0.184452 0.056016 -0.272876 0.190141 -0.103962 -0.482067 0.194382 0.196406 0.205029 0.070001 -0.173535 0.204390 -0.198202 0.185464 0.056056 -0.290392 0.192774 -0.065285 -0.483706 0.200625 0.194621 0.201173 0.057958 -0.168641 0.201452 -0.201720 0.185880 0.061080 -0.283544 0.188519 -0.066996 -0.485270 0.194875 0.198816 0.203782 -0.421540 0.234496 -0.538071 0.217943 0.219095 0.200652 -0.473483 0.187328 0.187803 0.172749 -0.441637 0.261496 -0.473013 0.191926 0.203226 0.191937 -0.485174 0.192501 0.177685 0.197410 -0.434883 0.236100 -0.525337 0.186494 0.213922 0.190549 -0.481869 0.194311 0.202283 0.195834 -0.440246 0.263757 -0.471048 0.194455 0.195358 0.193332 -0.495394 0.193992 0.220997 0.193208 -0.467219 0.243720 -0.486264 0.195877 0.213415 0.199076 -0.489729 0.194799 0.214328 0.193602 -0.457562 0.262046 -0.461182 0.191020 0.200959 0.189908 -0.492484 0.197837 0.211449 0.199324 0.036553 -0.143694 -0.513312 0.256911 0.258629 0.206185 -0.742716
charge: -0.809538 0.815694 0.823705 0.818722 0.010995 0.002495 -0.148439 0.169500 -0.123305 0.163951 -0.046620 -0.127881 0.160783 -0.168135 -0.384534 0.156105 0.157035 0.163792 0.002483 -0.147283 0.169700 -0.121376 0.164554 -0.045887 -0.133165 0.161101 -0.166083 -0.384645 0.161622 0.154008 0.161896 -0.000493 -0.148218 0.170298 -0.123411 0.164660 -0.045018 -0.134089 0.159998 -0.168122 -0.384532 0.154331 0.160197 0.163291 -0.283728 0.157886 -0.395967 0.152950 0.145111 0.155013 -0.403286 0.149712 0.145139 0.132784 -0.281345 0.160440 -0.397102 0.146380 0.144282 0.151688 -0.401310 0.151695 0.132124 0.145299 -0.286023 0.157027 -0.406520 0.134446 0.143325 0.150920 -0.394986 0.153385 0.146203 0.147870 -0.285607 0.163846 -0.397391 0.146860 0.146250 0.152826 -0.394745 0.152780 0.147302 0.146158 -0.286949 0.161704 -0.397944 0.155271 0.144729 0.146713 -0.392812 0.148036 0.150295 0.152105 -0.281635 0.161050 -0.397187 0.146070 0.145086 0.152095 -0.396834 0.154618 0.147723 0.145307 0.167773 0.090635 -0.423023 0.202990 0.204327 0.169808 -0.781787
qa: 0.4310 0.4196 0.4284 0.4321 -0.4141 0.0890 -0.1744 0.2041 -0.2040 0.1845 0.0560 -0.2729 0.1901 -0.1040 -0.4821 0.1944 0.1964 0.2050 0.0700 -0.1735 0.2044 -0.1982 0.1855 0.0561 -0.2904 0.1928 -0.0653 -0.4837 0.2006 0.1946 0.2012 0.0580 -0.1686 0.2015 -0.2017 0.1859 0.0611 -0.2835 0.1885 -0.0670 -0.4853 0.1949 0.1988 0.2038 -0.4215 0.2345 -0.5381 0.2179 0.2191 0.2007 -0.4735 0.1873 0.1878 0.1727 -0.4416 0.2615 -0.4730 0.1919 0.2032 0.1919 -0.4852 0.1925 0.1777 0.1974 -0.4349 0.2361 -0.5253 0.1865 0.2139 0.1905 -0.4819 0.1943 0.2023 0.1958 -0.4402 0.2638 -0.4710 0.1945 0.1954 0.1933 -0.4954 0.1940 0.2210 0.1932 -0.4672 0.2437 -0.4863 0.1959 0.2134 0.1991 -0.4897 0.1948 0.2143 0.1936 -0.4576 0.2620 -0.4612 0.1910 0.2010 0.1899 -0.4925 0.1978 0.2114 0.1993 0.0366 -0.1437 -0.5133 0.2569 0.2586 0.2062 -0.7427
va: 6.2804 3.7343 3.7497 3.7120 3.0501 3.9649 3.8102 0.9305 3.8315 0.9391 3.9156 3.8845 0.9441 3.8544 3.8151 0.9299 0.9285 0.9205 3.9753 3.8083 0.9303 3.8152 0.9376 3.9131 3.9114 0.9442 3.8520 3.8146 0.9232 0.9334 0.9230 3.9860 3.8061 0.9314 3.8167 0.9375 3.9165 3.8964 0.9484 3.8463 3.8154 0.9328 0.9248 0.9215 3.9151 0.8997 3.7774 0.9299 0.9218 0.9271 3.7641 0.9323 0.9432 1.0055 3.9135 0.8685 3.7904 0.9308 0.9275 0.9299 3.7696 0.9271 0.9953 0.9286 3.9272 0.8991 3.7394 1.0111 0.9228 0.9339 3.7913 0.9306 0.9315 0.9378 3.9079 0.8632 3.7987 0.9308 0.9320 0.9281 3.7879 0.9280 0.9263 0.9368 3.9252 0.8938 3.7845 0.9276 0.9236 0.9362 3.7988 0.9322 0.9289 0.9294 3.9202 0.8678 3.7860 0.9367 0.9295 0.9314 3.7796 0.9267 0.9280 0.9353 4.0010 3.2826 3.7351 0.9096 0.9090 1.0529 0.4978
dispersion: -0.189054770 hartree
energy: -4466.963196278864 hartree
dipole: 14.10011 -8.97829 5.12181 5.68517 -2.76530 2.91987 -6.11535 0.58767 -5.52767
magnitude: 8.08169 au
magnitude: 20.54203 debye
temp: 298.15 k
press: 1.00 atm
zeropoint: 0.96181107 hartree
thermalvibcorrection: 0.05530966 hartree
thermalrotcorrection: 0.00141627 hartree
thermaltrasncorrection: 0.00141627 hartree
thermaltotal: -4465.94324301 hartree
thermalcorr: 0.05814220 hartree
nonthermalcorr: 0.96181107 hartree
totalcorr: 1.01995327 hartree
thermalcorrenthalpy: 0.00094421 hartree
totalenthalpy: -4465.94229880 hartree
vibrat: 0.09985682 hartree
rotat: 0.01835078 hartree
transl: 0.02175884 hartree
total: 0.14148604 hartree
totalentropycorr: -0.14148604 hartree
gibbsenthalpy: -4466.08378484 hartree
gibbsminuselec: 0.87941144 hartree
