program: Orca
programVersion: 5.0
elementType: Fe P P P Cl N C C H C H C C H C C H H H C C H C H C C H C C H H H C C H C H C C H C C H H H C H C H H H C H H H C H C H H H C H H H C H C H H H C H H H C H C H H H C H H H C H C H H H C H H H C H C H H H C H H H C N C H H H
keywords: PBE0 D4 DKH2 DKH-def2-SV(P) def2-tzvp/c Opt Freq UNO UCO NormalPrint CPCM(acetonitrile)
charge: 1
multiplicity: 5
frequency: 0.00 0.00 0.00 0.00 0.00 0.00 -12.90 16.92 19.94 25.37 26.99 31.76 39.78 40.66 43.63 45.66 51.43 52.50 61.05 63.64 65.60 73.32 77.52 80.00 81.00 86.05 90.12 93.15 96.35 101.38 105.43 108.70 110.99 115.92 117.09 118.29 122.86 124.79 136.68 143.36 147.80 149.84 153.67 157.92 173.34 177.27 185.88 196.20 200.46 204.90 210.51 212.05 221.50 230.86 232.45 235.36 240.72 244.07 247.68 249.52 253.53 257.71 260.14 264.49 265.97 270.88 274.02 276.29 282.63 297.22 301.27 310.95 318.59 325.71 328.93 337.17 344.48 349.59 355.45 365.24 371.96 379.97 384.96 391.40 400.89 407.21 408.72 409.39 414.19 426.34 446.01 450.21 467.67 474.96 476.39 484.30 489.24 495.77 501.83 511.77 526.62 544.50 552.40 561.73 587.37 588.25 593.37 614.41 622.91 630.15 667.22 681.12 683.93 686.54 700.20 701.05 706.36 770.53 772.57 774.32 837.75 842.61 855.10 883.27 885.73 908.18 910.08 917.91 921.28 921.82 922.59 923.42 925.22 928.70 929.02 941.04 941.50 946.26 947.72 949.80 951.96 954.29 956.98 963.93 983.76 983.98 984.58 985.75 989.08 991.05 995.74 997.24 997.63 1024.50 1024.86 1024.96 1050.73 1051.46 1051.59 1059.47 1061.66 1064.87 1065.25 1066.08 1070.72 1074.37 1084.87 1089.75 1105.94 1106.58 1135.62 1145.98 1148.07 1148.86 1153.46 1154.66 1176.73 1176.79 1179.56 1192.33 1194.23 1194.81 1195.49 1195.82 1197.46 1227.97 1258.56 1260.48 1265.47 1282.73 1284.60 1287.41 1293.33 1296.02 1298.39 1301.44 1308.90 1315.79 1321.66 1325.40 1334.70 1337.64 1339.54 1341.07 1349.32 1353.65 1375.22 1389.40 1389.60 1401.17 1405.22 1405.75 1406.93 1407.13 1408.81 1409.99 1413.50 1413.83 1414.20 1418.11 1419.02 1419.78 1422.91 1424.67 1430.82 1441.17 1441.94 1442.81 1447.25 1451.32 1472.67 1474.00 1474.15 1476.18 1477.43 1478.81 1480.37 1480.77 1483.21 1483.84 1485.08 1485.47 1486.43 1487.07 1487.41 1488.03 1488.51 1490.19 1491.84 1492.30 1494.24 1494.39 1497.89 1498.90 1501.46 1503.06 1504.75 1509.34 1512.24 1518.87 1540.59 1541.84 1549.52 1646.08 1651.55 1652.54 1687.64 1688.28 1691.63 2406.18 3054.26 3054.79 3057.58 3058.01 3058.49 3058.97 3061.52 3061.74 3063.76 3064.09 3066.91 3068.57 3068.73 3069.86 3073.69 3074.91 3086.04 3086.66 3091.83 3114.38 3125.35 3131.73 3139.41 3139.80 3140.41 3140.75 3140.88 3142.48 3147.63 3147.90 3149.21 3149.33 3150.16 3152.99 3153.23 3155.76 3157.42 3160.12 3167.92 3168.00 3168.69 3169.19 3171.66 3173.86 3174.27 3175.78 3176.84 3177.44 3179.59 3184.35 3185.53 3186.20 3187.74 3214.55 3216.09 3216.88 3217.23 3223.54 3227.79 3236.46 3237.67 3239.03 3259.57
frequency: 16.92 19.94 25.37 26.99 31.76 39.78 40.66 43.63 45.66 51.43 52.50 61.05 63.64 65.60 73.32 77.52 80.00 81.00 86.05 90.12 93.15 96.35 101.38 105.43 108.70 110.99 115.92 117.09 118.29 122.86 124.79 136.68 143.36 147.80 149.84 153.67 157.92 173.34 177.27 185.88 196.20 200.46 204.90 210.51 212.05 221.50 230.86 232.45 235.36 240.72 244.07 247.68 249.52 253.53 257.71 260.14 264.49 265.97 270.88 274.02 276.29 282.63 297.22 301.27 310.95 318.59 325.71 328.93 337.17 344.48 349.59 355.45 365.24 371.96 379.97 384.96 391.40 400.89 407.21 408.72 409.39 414.19 426.34 446.01 450.21 467.67 474.96 476.39 484.30 489.24 495.77 501.83 511.77 526.62 544.50 552.40 561.73 587.37 588.25 593.37 614.41 622.91 630.15 667.22 681.12 683.93 686.54 700.20 701.05 706.36 770.53 772.57 774.32 837.75 842.61 855.10 883.27 885.73 908.18 910.08 917.91 921.28 921.82 922.59 923.42 925.22 928.70 929.02 941.04 941.50 946.26 947.72 949.80 951.96 954.29 956.98 963.93 983.76 983.98 984.58 985.75 989.08 991.05 995.74 997.24 997.63 1024.50 1024.86 1024.96 1050.73 1051.46 1051.59 1059.47 1061.66 1064.87 1065.25 1066.08 1070.72 1074.37 1084.87 1089.75 1105.94 1106.58 1135.62 1145.98 1148.07 1148.86 1153.46 1154.66 1176.73 1176.79 1179.56 1192.33 1194.23 1194.81 1195.49 1195.82 1197.46 1227.97 1258.56 1260.48 1265.47 1282.73 1284.60 1287.41 1293.33 1296.02 1298.39 1301.44 1308.90 1315.79 1321.66 1325.40 1334.70 1337.64 1339.54 1341.07 1349.32 1353.65 1375.22 1389.40 1389.60 1401.17 1405.22 1405.75 1406.93 1407.13 1408.81 1409.99 1413.50 1413.83 1414.20 1418.11 1419.02 1419.78 1422.91 1424.67 1430.82 1441.17 1441.94 1442.81 1447.25 1451.32 1472.67 1474.00 1474.15 1476.18 1477.43 1478.81 1480.37 1480.77 1483.21 1483.84 1485.08 1485.47 1486.43 1487.07 1487.41 1488.03 1488.51 1490.19 1491.84 1492.30 1494.24 1494.39 1497.89 1498.90 1501.46 1503.06 1504.75 1509.34 1512.24 1518.87 1540.59 1541.84 1549.52 1646.08 1651.55 1652.54 1687.64 1688.28 1691.63 2406.18 3054.26 3054.79 3057.58 3058.01 3058.49 3058.97 3061.52 3061.74 3063.76 3064.09 3066.91 3068.57 3068.73 3069.86 3073.69 3074.91 3086.04 3086.66 3091.83 3114.38 3125.35 3131.73 3139.41 3139.80 3140.41 3140.75 3140.88 3142.48 3147.63 3147.90 3149.21 3149.33 3150.16 3152.99 3153.23 3155.76 3157.42 3160.12 3167.92 3168.00 3168.69 3169.19 3171.66 3173.86 3174.27 3175.78 3176.84 3177.44 3179.59 3184.35 3185.53 3186.20 3187.74 3214.55 3216.09 3216.88 3217.23 3223.54 3227.79 3236.46 3237.67 3239.03 3259.57
formula: C41H63ClFeN2P3
InChI: InChI=1/C39H60NP3.C2H3N.ClH.Fe/c1-25(2)41(26(3)4)37-22-31(13)16-19-34(37)40(35-20-17-32(14)23-38(35)42(27(5)6)28(7)8)36-21-18-33(15)24-39(36)43(29(9)10)30(11)12;1-2-3;;/h16-30H,1-15H3;1H3;1H;/q;;;+1/p-1/rC39H60NP3.C2H3N.ClFe/c1-25(2)41(26(3)4)37-22-31(13)16-19-34(37)40(35-20-17-32(14)23-38(35)42(27(5)6)28(7)8)36-21-18-33(15)24-39(36)43(29(9)10)30(11)12;1-2-3;1-2/h16-30H,1-15H3;1H3;
111 atoms
Fe 0.015152 -0.148045 0.042264
P  -0.816435 -2.336473 -0.757361
P  -1.660802 1.542711 -0.517228
P  2.135246 0.604423 -1.002817
Cl 0.064531 -0.237039 2.315548
N  -0.298516 -0.052369 -2.711086
C  0.272497 -1.297186 -3.129391
C  1.026509 -1.372543 -4.303622
H  1.191115 -0.473352 -4.894702
C  1.56348 -2.584364 -4.723182
H  2.153079 -2.617249 -5.640093
C  1.34101 -3.760865 -3.998187
C  0.574669 -3.672751 -2.832415
H  0.396917 -4.586231 -2.265793
C  0.052439 -2.459994 -2.36877
C  1.926348 -5.070651 -4.441859
H  1.902848 -5.168324 -5.535373
H  1.384602 -5.919268 -4.005432
H  2.978763 -5.153753 -4.130081
C  -1.72165 0.038407 -2.874001
C  -2.355153 -0.633975 -3.921614
H  -1.766015 -1.249176 -4.599784
C  -3.730853 -0.533192 -4.097141
H  -4.206421 -1.080474 -4.911789
C  -4.507176 0.26654 -3.250704
C  -3.857351 0.941436 -2.211498
H  -4.463029 1.549893 -1.54087
C  -2.479733 0.830749 -1.993121
C  -5.987554 0.408213 -3.458244
H  -6.200736 1.126455 -4.264726
H  -6.486697 0.771382 -2.551108
H  -6.443504 -0.548157 -3.746692
C  0.403416 1.124773 -3.136522
C  -0.097764 1.892723 -4.192691
H  -1.002968 1.572327 -4.705105
C  0.527789 3.07286 -4.575036
H  0.107474 3.659893 -5.392273
C  1.682125 3.51616 -3.919257
C  2.185949 2.727074 -2.881681
H  3.073347 3.082046 -2.364654
C  1.572602 1.535901 -2.473212
C  2.362513 4.79215 -4.323719
H  3.113081 5.09748 -3.584134
H  1.638033 5.609818 -4.438958
H  2.873467 4.673286 -5.291022
C  -0.131809 -3.761215 0.233579
H  -0.361788 -4.688903 -0.311602
C  1.381133 -3.597283 0.365911
H  1.614241 -2.70825 0.969426
H  1.898098 -3.505079 -0.59631
H  1.799715 -4.468664 0.890122
C  -0.744209 -3.842419 1.633778
H  -0.183756 -4.58672 2.218468
H  -1.792307 -4.150803 1.632285
H  -0.667204 -2.879566 2.15619
C  -2.608391 -2.707173 -1.175208
H  -2.960014 -1.75065 -1.582986
C  -2.750495 -3.776648 -2.252526
H  -2.327949 -4.738447 -1.926514
H  -2.265232 -3.489563 -3.193218
H  -3.818916 -3.936705 -2.461622
C  -3.473625 -3.043933 0.03793
H  -4.529089 -2.899857 -0.234496
H  -3.26774 -2.417947 0.913278
H  -3.353991 -4.094637 0.331332
C  -3.036342 1.738604 0.719739
H  -3.829918 2.330241 0.240629
C  -3.584367 0.36423 1.090083
H  -2.804664 -0.251341 1.557575
H  -3.973984 -0.179015 0.220541
H  -4.40593 0.473572 1.813326
C  -2.563144 2.492779 1.962402
H  -3.345318 2.438083 2.733528
H  -2.379024 3.553672 1.760109
H  -1.648982 2.051079 2.382105
C  -1.142791 3.255304 -1.048269
H  -0.541422 3.047449 -1.942086
C  -2.311122 4.140088 -1.465899
H  -2.955313 4.399185 -0.613843
H  -2.931385 3.660432 -2.235317
H  -1.926256 5.080669 -1.887513
C  -0.226261 3.931678 -0.029665
H  0.340112 4.733807 -0.524242
H  0.497214 3.232048 0.409267
H  -0.790085 4.38575 0.793668
C  3.157681 1.826765 -0.022785
H  2.584117 2.75785 -0.148467
C  4.59185 2.077991 -0.490314
H  4.992352 2.938716 0.065213
H  4.682539 2.304817 -1.558072
H  5.242189 1.222176 -0.274757
C  3.137525 1.472092 1.46417
H  3.654383 0.523494 1.663682
H  2.116601 1.384191 1.853983
H  3.65761 2.259072 2.0299
C  3.234724 -0.77026 -1.641056
H  2.501379 -1.516407 -1.975395
C  4.095517 -0.398333 -2.84264
H  4.886467 0.315695 -2.582851
H  3.498082 0.032081 -3.656416
H  4.580377 -1.306907 -3.229962
C  4.044165 -1.403932 -0.510615
H  4.455428 -2.362862 -0.85722
H  3.433939 -1.607431 0.377973
H  4.889229 -0.775618 -0.204219
C  -3.116252 -1.433118 4.270231
N  -3.462303 -2.442939 3.819716
C  -2.675633 -0.165965 4.822413
H  -1.725843 0.122527 4.352908
H  -2.533873 -0.253265 5.90726
H  -3.422209 0.612563 4.620033
elementType: Fe P Cl N C H
totalener: -4466.79551675 hartree
nucrepener: 9393.22551459 hartree
cpcmener: -0.06666723 hartree
kineticenergy: 4540.08751360 hartree
exchangeener: -298.157943862802 hartree
correlationener: -14.274076835419 hartree
xcener: -312.432020698222 hartree
s2: 6.021234
dispersion: -0.188803835 hartree
s2: 6.021194
dispersion: -0.188609817 hartree
s2: 6.021216
dispersion: -0.188091174 hartree
s2: 6.021230
dispersion: -0.188301869 hartree
s2: 6.021203
dispersion: -0.188149073 hartree
s2: 6.021245
dispersion: -0.187899531 hartree
s2: 6.021259
dispersion: -0.188085054 hartree
s2: 6.021236
dispersion: -0.188012139 hartree
s2: 6.021215
dispersion: -0.188130959 hartree
s2: 6.021188
dispersion: -0.188260510 hartree
s2: 6.021122
dispersion: -0.188455554 hartree
s2: 6.021082
dispersion: -0.188722834 hartree
s2: 6.021071
dispersion: -0.188748041 hartree
s2: 6.020953
dispersion: -0.188505808 hartree
s2: 6.020924
dispersion: -0.188721131 hartree
s2: 6.020997
dispersion: -0.188743807 hartree
s2: 6.020998
dispersion: -0.189142147 hartree
s2: 6.021026
dispersion: -0.189166826 hartree
s2: 6.021024
dispersion: -0.189316478 hartree
s2: 6.021115
dispersion: -0.189450161 hartree
s2: 6.021079
dispersion: -0.189478830 hartree
s2: 6.021016
dispersion: -0.189558232 hartree
s2: 6.020993
dispersion: -0.189154273 hartree
s2: 6.021092
dispersion: -0.189329974 hartree
s2: 6.021048
dispersion: -0.189368405 hartree
s2: 6.021041
dispersion: -0.189484502 hartree
s2: 6.021045
dispersion: -0.189375435 hartree
s2: 6.021047
dispersion: -0.189393976 hartree
s2: 6.021038
dispersion: -0.189421182 hartree
s2: 6.021030
dispersion: -0.189425179 hartree
s2: 6.021027
dispersion: -0.189424132 hartree
s2: 6.021022
dispersion: -0.189417291 hartree
s2: 6.021020
dispersion: -0.189420605 hartree
s2: 6.021021
dispersion: -0.189414310 hartree
s2: 6.021023
dispersion: -0.189407296 hartree
s2: 6.021029
dispersion: -0.189409606 hartree
s2: 6.021036
dispersion: -0.189405624 hartree
s2: 6.021044
dispersion: -0.189409841 hartree
s2: 6.021050
chargesum: 1.0000000
charge: 0.228422 0.422112 0.445720 0.430028 -0.330549 -0.401126 0.088258 -0.177977 0.200951 -0.202862 0.182315 0.057659 -0.280028 0.189313 -0.104580 -0.483022 0.194479 0.194160 0.203470 0.063426 -0.171520 0.201130 -0.206270 0.182793 0.055150 -0.292415 0.189140 -0.064099 -0.482713 0.203648 0.193737 0.195454 0.057357 -0.167197 0.198386 -0.205764 0.183754 0.061014 -0.288028 0.187833 -0.069027 -0.485046 0.194104 0.197184 0.203015 -0.424224 0.228462 -0.532450 0.210388 0.218743 0.196915 -0.478857 0.187022 0.188428 0.180707 -0.438073 0.258873 -0.473654 0.190208 0.202991 0.189512 -0.499072 0.191917 0.208030 0.199951 -0.431800 0.230437 -0.542639 0.218200 0.213935 0.196513 -0.486205 0.194765 0.198907 0.184387 -0.441707 0.261112 -0.469948 0.191190 0.192689 0.189699 -0.493181 0.190663 0.218374 0.190219 -0.469400 0.240123 -0.483602 0.193283 0.209551 0.197634 -0.482002 0.187359 0.200882 0.188177 -0.461099 0.261810 -0.459946 0.189511 0.198846 0.187153 -0.489851 0.195180 0.209975 0.197475 -0.039496 -0.181302 -0.524854 0.234375 0.246164 0.250834
charge: -1.072183 0.807585 0.824545 0.810266 0.048115 -0.000310 -0.000004 -0.150476 0.167728 -0.124324 0.162734 -0.049862 -0.130370 0.159687 -0.171150 -0.384813 0.157051 0.154700 0.162695 -0.001443 -0.148653 0.168108 -0.126773 0.163009 -0.048474 -0.135301 0.159350 -0.167410 -0.384767 0.163002 0.154491 0.157663 -0.003145 -0.149250 0.168742 -0.126834 0.163405 -0.047244 -0.136921 0.159222 -0.169772 -0.384715 0.153964 0.159076 0.162746 -0.283972 0.155453 -0.396037 0.150410 0.144465 0.153488 -0.402097 0.149260 0.143389 0.136912 -0.282631 0.159613 -0.397028 0.145147 0.144006 0.150297 -0.397544 0.151736 0.141988 0.145552 -0.283460 0.154282 -0.398710 0.146619 0.144457 0.150684 -0.398321 0.150126 0.144187 0.140481 -0.288863 0.162379 -0.397680 0.145204 0.144902 0.150582 -0.395297 0.150556 0.146486 0.144610 -0.288514 0.160122 -0.398478 0.153897 0.143495 0.145854 -0.398861 0.145102 0.142128 0.149279 -0.283619 0.160671 -0.397416 0.145190 0.144142 0.150400 -0.396054 0.153167 0.147204 0.144011 -0.004782 -0.159788 -0.416331 0.174908 0.193248 0.191705
qa: 0.2284 0.4221 0.4457 0.4300 -0.3305 -0.4011 0.0883 -0.1780 0.2010 -0.2029 0.1823 0.0577 -0.2800 0.1893 -0.1046 -0.4830 0.1945 0.1942 0.2035 0.0634 -0.1715 0.2011 -0.2063 0.1828 0.0552 -0.2924 0.1891 -0.0641 -0.4827 0.2036 0.1937 0.1955 0.0574 -0.1672 0.1984 -0.2058 0.1838 0.0610 -0.2880 0.1878 -0.0690 -0.4850 0.1941 0.1972 0.2030 -0.4242 0.2285 -0.5325 0.2104 0.2187 0.1969 -0.4789 0.1870 0.1884 0.1807 -0.4381 0.2589 -0.4737 0.1902 0.2030 0.1895 -0.4991 0.1919 0.2080 0.2000 -0.4318 0.2304 -0.5426 0.2182 0.2139 0.1965 -0.4862 0.1948 0.1989 0.1844 -0.4417 0.2611 -0.4699 0.1912 0.1927 0.1897 -0.4932 0.1907 0.2184 0.1902 -0.4694 0.2401 -0.4836 0.1933 0.2096 0.1976 -0.4820 0.1874 0.2009 0.1882 -0.4611 0.2618 -0.4599 0.1895 0.1988 0.1872 -0.4899 0.1952 0.2100 0.1975 -0.0395 -0.1813 -0.5249 0.2344 0.2462 0.2508
va: 6.6185 3.7008 3.7274 3.6810 1.2273 3.0580 3.9769 3.8086 0.9325 3.8240 0.9391 3.9092 3.8910 0.9431 3.8491 3.8151 0.9279 0.9311 0.9209 3.9911 3.8001 0.9320 3.8217 0.9388 3.9115 3.8994 0.9448 3.8436 3.8157 0.9210 0.9317 0.9274 3.9998 3.8031 0.9330 3.8178 0.9380 3.9157 3.8962 0.9472 3.8375 3.8162 0.9327 0.9256 0.9215 3.9135 0.9028 3.7678 0.9449 0.9216 0.9280 3.7756 0.9313 0.9459 0.9815 3.9133 0.8701 3.7907 0.9319 0.9272 0.9306 3.7933 0.9275 0.9420 0.9247 3.9333 0.9014 3.7579 0.9505 0.9218 0.9266 3.7779 0.9311 0.9316 0.9667 3.9085 0.8643 3.8018 0.9316 0.9327 0.9286 3.7908 0.9287 0.9276 0.9372 3.9272 0.8956 3.7819 0.9283 0.9243 0.9363 3.7827 0.9358 0.9648 0.9299 3.9209 0.8665 3.7870 0.9365 0.9305 0.9323 3.7829 0.9275 0.9277 0.9350 4.0410 3.0633 3.8088 0.9583 0.9122 0.9149
dispersion: -0.189406877 hartree
energy: -4466.992419435564 hartree
dipole: 3.95389 -3.16316 0.79072 4.15275 -2.29616 1.85659 -4.13487 1.03570 -3.09917
magnitude: 3.69824 au
magnitude: 9.40018 debye
temp: 298.15 k
press: 1.00 atm
zeropoint: 0.96178761 hartree
thermalvibcorrection: 0.05648653 hartree
thermalrotcorrection: 0.00141627 hartree
thermaltrasncorrection: 0.00141627 hartree
thermaltotal: -4465.97131275 hartree
thermalcorr: 0.05931907 hartree
nonthermalcorr: 0.96178761 hartree
totalcorr: 1.02110668 hartree
thermalcorrenthalpy: 0.00094421 hartree
totalenthalpy: -4465.97036854 hartree
vibrat: 0.10260034 hartree
rotat: 0.01834053 hartree
transl: 0.02175884 hartree
total: 0.14421931 hartree
totalentropycorr: -0.14421931 hartree
gibbsenthalpy: -4466.11458785 hartree
gibbsminuselec: 0.87783158 hartree
