program: Orca
programVersion: 5.0
elementType: Fe P P P N C C H C H C C H C C H H H C C H C H C C H C C H H H C C H C H C C H C C H H H C H C H H H C H H H C H C H H H C H H H C H C H H H C H H H C H C H H H C H H H C H C H H H C H H H C H C H H H C H H H C N C H H H Cl
charge: 1
multiplicity: 5
keywords: DLPNO-CCSD(T) DKH2 DKH-def2-TZVP def2-tzvp/c CPCM(acetonitrile) RIJCOSX noautostart
formula: C41H63ClFeN2P3
InChI: InChI=1/C39H60NP3.C2H3N.Cl.Fe/c1-25(2)41(26(3)4)37-22-31(13)16-19-34(37)40(35-20-17-32(14)23-38(35)42(27(5)6)28(7)8)36-21-18-33(15)24-39(36)43(29(9)10)30(11)12;1-2-3;;/h16-30H,1-15H3;1H3;;/rC39H60NP3.C2H3FeN.Cl/c1-25(2)41(26(3)4)37-22-31(13)16-19-34(37)40(35-20-17-32(14)23-38(35)42(27(5)6)28(7)8)36-21-18-33(15)24-39(36)43(29(9)10)30(11)12;1-2-4-3;/h16-30H,1-15H3;1H3;
111 atoms
Fe -0.298373 1.426571 2.666121
P  -1.073676 -0.792474 1.941655
P  -1.941493 3.165642 2.150186
P  1.892846 2.138667 1.807518
N  -0.496771 1.530316 0.035352
C  0.082338 0.284361 -0.384825
C  0.873307 0.224737 -1.534346
H  1.06076 1.131249 -2.106698
C  1.422618 -0.981886 -1.954942
H  2.041598 -1.001266 -2.852451
C  1.177334 -2.167452 -1.254551
C  0.373608 -2.094887 -0.112611
H  0.180726 -3.016679 0.434576
C  -0.164706 -0.889875 0.350863
C  1.777123 -3.473414 -1.68916
H  1.968565 -3.485171 -2.769726
H  1.12024 -4.317229 -1.441514
H  2.738883 -3.647431 -1.182608
C  -1.912609 1.639336 -0.194401
C  -2.507304 0.97209 -1.267578
H  -1.897628 0.346168 -1.916912
C  -3.870636 1.096853 -1.50786
H  -4.315857 0.556701 -2.34414
C  -4.672899 1.913658 -0.701905
C  -4.061681 2.58461 0.361801
H  -4.686067 3.209966 0.998827
C  -2.697185 2.450653 0.644254
C  -6.143705 2.054424 -0.968272
H  -6.325195 2.452989 -1.976821
H  -6.619142 2.728071 -0.244906
H  -6.64931 1.079833 -0.91086
C  0.237142 2.699312 -0.371288
C  -0.215185 3.476879 -1.441372
H  -1.116657 3.184027 -1.976249
C  0.460183 4.633028 -1.813507
H  0.07921 5.22875 -2.64355
C  1.615185 5.040314 -1.135373
C  2.066405 4.24275 -0.080526
H  2.955221 4.566964 0.454415
C  1.400301 3.077963 0.319577
C  2.348613 6.288538 -1.532804
H  3.121165 6.549083 -0.798903
H  1.660756 7.139953 -1.627564
H  2.840191 6.159287 -2.508569
C  -0.407086 -2.232167 2.919669
H  -0.553125 -3.136104 2.310673
C  1.084951 -2.00993 3.153042
H  1.248186 -1.126218 3.786334
H  1.650873 -1.879729 2.223103
H  1.507095 -2.876485 3.681925
C  -1.119996 -2.434368 4.256691
H  -0.515768 -3.114111 4.875214
H  -2.106733 -2.891554 4.142164
H  -1.256106 -1.503271 4.822762
C  -2.863557 -1.114162 1.494777
H  -3.179797 -0.146282 1.084084
C  -3.00922 -2.174689 0.408911
H  -2.618213 -3.147784 0.740545
H  -2.496397 -1.895546 -0.519704
H  -4.076487 -2.306498 0.176349
C  -3.758709 -1.432529 2.693339
H  -4.799482 -1.207021 2.419918
H  -3.521724 -0.866191 3.602642
H  -3.713941 -2.500227 2.942367
C  -3.357112 3.380421 3.331979
H  -4.105312 4.003794 2.821082
C  -3.971901 2.025995 3.669056
H  -3.309085 1.428008 4.309761
H  -4.224283 1.438938 2.777887
H  -4.899814 2.181091 4.239001
C  -2.917945 4.106822 4.603639
H  -3.727467 4.047208 5.345308
H  -2.711932 5.168541 4.42942
H  -2.024696 3.648888 5.051538
C  -1.355031 4.862975 1.648309
H  -0.717036 4.642062 0.783659
C  -2.487616 5.768242 1.179036
H  -3.166922 6.03434 2.000914
H  -3.077264 5.30442 0.376597
H  -2.064364 6.703321 0.783329
C  -0.477993 5.521536 2.711732
H  0.115087 6.321518 2.246269
H  0.220134 4.813172 3.175983
H  -1.073286 5.975277 3.512561
C  2.844553 3.364403 2.853038
H  2.294278 4.299086 2.667298
C  4.313042 3.59946 2.498741
H  4.676362 4.456196 3.08485
H  4.48501 3.829522 1.441773
H  4.93936 2.738687 2.759629
C  2.693548 3.028095 4.336672
H  3.111791 2.042221 4.580696
H  1.643774 3.043171 4.650942
H  3.23357 3.776714 4.934341
C  3.024378 0.766671 1.226942
H  2.310902 0.020736 0.85022
C  3.944757 1.14707 0.07338
H  4.707192 1.876553 0.372371
H  3.385699 1.56108 -0.775344
H  4.465516 0.244443 -0.279276
C  3.775241 0.135174 2.398513
H  4.192541 -0.830257 2.078863
H  3.125174 -0.054103 3.261559
H  4.611338 0.758925 2.736063
C  -0.257012 1.194778 5.844367
N  -0.255493 1.319842 4.695325
C  -0.287445 1.018933 7.270945
H  -0.176072 1.989138 7.77251
H  0.523468 0.346089 7.57979
H  -1.273927 0.566825 7.497766
Cl -3.30167 -0.310655 6.595737
elementType: Fe P N C H Cl
totalener: -4456.34027303 hartree
nucrepener: 9375.74071563 hartree
cpcmener: -0.12707288 hartree
kineticenergy: 4536.57875311 hartree
s2: 7.413159
chargesum: 1.0000000
charge: 0.884860 0.010306 0.064836 0.019882 0.012513 0.136172 -0.254991 0.160884 -0.181242 0.164173 0.181065 -0.230426 0.176000 -0.114391 -0.445286 0.143913 0.144852 0.142575 0.140366 -0.245432 0.163262 -0.170513 0.164164 0.196921 -0.273081 0.179095 -0.086318 -0.447500 0.142656 0.144040 0.142252 0.131393 -0.270921 0.160863 -0.136969 0.166247 0.126314 -0.157059 0.171386 -0.141286 -0.452412 0.143841 0.142905 0.143904 -0.004991 0.122755 -0.451297 0.129006 0.153885 0.147946 -0.448329 0.139164 0.135621 0.152009 0.096086 0.079877 -0.433671 0.141730 0.145085 0.141115 -0.475585 0.145157 0.164742 0.145713 -0.033357 0.128558 -0.468198 0.160661 0.149120 0.137385 -0.430111 0.143723 0.141722 0.130729 0.089389 0.079609 -0.440655 0.140859 0.145022 0.140781 -0.424014 0.143075 0.126946 0.143995 -0.052486 0.127964 -0.419685 0.145764 0.146182 0.135811 -0.421473 0.143325 0.133443 0.143409 0.065557 0.080415 -0.416453 0.143483 0.145379 0.138315 -0.435924 0.147404 0.150263 0.143312 0.337493 -0.419254 -0.363886 0.199498 0.198678 0.206720 -0.928327
charge: -0.025365 0.849579 0.850799 0.852886 0.219647 -0.175559 -0.100283 0.161563 -0.091949 0.154421 -0.162465 -0.090920 0.156951 -0.221932 -0.236668 0.126004 0.126296 0.127512 -0.174549 -0.101227 0.161653 -0.089229 0.155044 -0.161916 -0.096740 0.156512 -0.218600 -0.236606 0.127119 0.125690 0.127168 -0.176186 -0.101003 0.162490 -0.091037 0.155051 -0.161067 -0.092470 0.156105 -0.221665 -0.236109 0.125906 0.126861 0.127797 -0.382090 0.146570 -0.283321 0.121689 0.120047 0.124155 -0.287988 0.122691 0.116456 0.112775 -0.387660 0.155921 -0.281460 0.120058 0.118574 0.123166 -0.288604 0.122176 0.111905 0.119431 -0.386749 0.146536 -0.291950 0.113831 0.119022 0.121809 -0.278033 0.124358 0.115781 0.119715 -0.389816 0.160443 -0.280640 0.120203 0.120325 0.122705 -0.281835 0.123004 0.117639 0.118263 -0.387423 0.153102 -0.283373 0.124102 0.113370 0.117594 -0.281920 0.119994 0.118661 0.122873 -0.389932 0.155799 -0.280179 0.119228 0.119650 0.123135 -0.281940 0.124121 0.118382 0.117317 -0.054533 0.093606 -0.233896 0.161255 0.161786 0.143053 -0.842440
qa: 0.8849 0.0103 0.0648 0.0199 0.0125 0.1362 -0.2550 0.1609 -0.1812 0.1642 0.1811 -0.2304 0.1760 -0.1144 -0.4453 0.1439 0.1449 0.1426 0.1404 -0.2454 0.1633 -0.1705 0.1642 0.1969 -0.2731 0.1791 -0.0863 -0.4475 0.1427 0.1440 0.1423 0.1314 -0.2709 0.1609 -0.1370 0.1662 0.1263 -0.1571 0.1714 -0.1413 -0.4524 0.1438 0.1429 0.1439 -0.0050 0.1228 -0.4513 0.1290 0.1539 0.1479 -0.4483 0.1392 0.1356 0.1520 0.0961 0.0799 -0.4337 0.1417 0.1451 0.1411 -0.4756 0.1452 0.1647 0.1457 -0.0334 0.1286 -0.4682 0.1607 0.1491 0.1374 -0.4301 0.1437 0.1417 0.1307 0.0894 0.0796 -0.4407 0.1409 0.1450 0.1408 -0.4240 0.1431 0.1269 0.1440 -0.0525 0.1280 -0.4197 0.1458 0.1462 0.1358 -0.4215 0.1433 0.1334 0.1434 0.0656 0.0804 -0.4165 0.1435 0.1454 0.1383 -0.4359 0.1474 0.1503 0.1433 0.3375 -0.4193 -0.3639 0.1995 0.1987 0.2067 -0.9283
va: 5.9026 3.6733 3.6295 3.6508 2.0991 3.5095 3.8337 0.9762 3.7442 0.9630 3.6078 3.6355 0.9388 3.8812 3.8505 0.9582 0.9581 0.9557 3.5199 3.7969 0.9743 3.7463 0.9620 3.5851 3.6554 0.9385 4.0223 3.8546 0.9549 0.9632 0.9554 3.5608 3.8568 0.9745 3.7065 0.9612 3.6576 3.6118 0.9296 3.9258 3.8582 0.9625 0.9555 0.9544 3.7543 0.9535 3.9001 0.9701 0.9415 0.9656 3.8703 0.9601 0.9674 0.9659 3.6577 0.9574 3.8954 0.9612 0.9565 0.9625 3.8642 0.9613 0.9573 0.9549 3.7678 0.9508 3.9028 0.9554 0.9419 0.9713 3.8760 0.9625 0.9617 0.9692 3.7185 0.9479 3.8781 0.9588 0.9544 0.9624 3.8741 0.9633 0.9624 0.9614 3.7497 0.9550 3.8752 0.9639 0.9541 0.9590 3.8570 0.9595 0.9693 0.9624 3.7607 0.9441 3.8669 0.9586 0.9586 0.9659 3.8666 0.9631 0.9493 0.9580 3.5202 3.0373 3.7066 0.9469 0.9483 0.9964 0.1203
corrType: DLPNO BASED
energy: -4465.309897581071 hartree
dipole: 14.10011 -8.58993 5.51017 5.68517 -2.64647 3.03870 -6.11535 0.71885 -5.39650
magnitude: 8.28962 au
magnitude: 21.07055 debye
