program: Orca
programVersion: 6.1.x
elementType: Fe P P P Cl N C C H C H C C H C C H H H C C H C H C C H C C H H H C C H C H C C H C C H H H C H C H H H C H H H C H C H H H C H H H C H C H H H C H H H C H C H H H C H H H C H C H H H C H H H C H C H H H C H H H C N C H H H
keywords: PBE0 D4 DKH2 DKH-def2-SV(P) def2-tzvp/c Opt Freq UNO UCO NormalPrint CPCM(acetonitrile)
charge: 0
multiplicity: 4
frequency: 0.00 0.00 0.00 0.00 0.00 0.00 -16.55 -10.02 19.26 28.32 32.13 36.42 38.17 41.99 43.51 50.85 51.20 59.26 62.61 69.99 71.16 79.31 81.65 84.82 87.43 92.47 95.50 98.29 102.58 105.24 113.93 115.57 119.71 123.41 128.14 130.56 133.14 139.91 144.53 147.32 149.48 152.14 156.13 159.80 178.91 182.72 184.80 195.32 196.43 202.43 210.39 216.78 225.30 228.74 232.83 235.01 243.01 243.46 245.93 249.57 254.22 255.72 259.02 262.10 262.77 265.28 270.97 273.60 279.40 285.19 298.88 301.37 313.09 324.44 324.94 338.99 341.20 346.48 351.89 365.73 369.95 377.08 383.51 387.60 397.38 408.62 410.12 415.45 415.59 426.76 444.46 451.61 464.65 467.04 475.59 481.88 485.65 495.32 497.63 510.29 524.56 544.78 553.21 562.92 580.34 590.94 594.24 601.90 610.72 623.92 653.08 669.80 672.57 676.48 697.53 697.72 703.88 770.19 772.28 774.02 833.82 838.85 849.15 879.68 882.80 903.23 911.10 917.08 919.26 920.49 921.21 921.73 926.49 927.24 931.41 935.73 936.84 943.32 943.58 949.83 952.75 955.84 956.09 964.44 980.27 981.83 982.37 984.22 987.49 988.68 989.16 989.54 990.55 1022.24 1022.47 1022.90 1044.66 1045.28 1045.67 1062.59 1063.49 1064.22 1064.39 1064.65 1067.12 1069.92 1080.42 1089.14 1104.56 1105.43 1133.16 1141.60 1145.54 1147.71 1149.42 1154.99 1170.40 1170.57 1171.90 1190.98 1192.38 1193.26 1195.04 1195.52 1197.57 1231.56 1257.83 1260.12 1264.07 1278.11 1280.16 1284.18 1292.23 1292.40 1300.92 1302.54 1304.55 1310.65 1330.50 1337.94 1338.51 1340.36 1341.24 1342.30 1350.24 1354.11 1369.70 1384.73 1385.44 1401.75 1401.95 1402.41 1403.27 1404.99 1405.53 1406.99 1412.80 1412.90 1412.96 1413.36 1414.95 1415.65 1417.85 1419.22 1427.30 1439.11 1440.92 1441.67 1447.63 1458.25 1473.91 1474.54 1474.68 1476.06 1476.60 1478.33 1478.71 1481.16 1482.95 1483.23 1484.36 1485.06 1485.96 1486.47 1487.53 1488.20 1489.10 1489.91 1490.91 1492.06 1493.88 1494.19 1496.83 1499.92 1501.41 1501.80 1505.95 1507.48 1510.70 1517.34 1538.25 1541.07 1547.93 1641.98 1647.91 1648.78 1684.16 1684.60 1689.37 2403.78 3045.75 3047.30 3048.49 3050.96 3051.84 3052.80 3053.03 3053.54 3053.69 3054.54 3054.63 3056.20 3058.99 3060.93 3061.17 3064.80 3071.52 3080.58 3084.25 3113.95 3115.75 3121.73 3126.74 3132.39 3134.43 3134.50 3134.70 3134.70 3135.29 3135.58 3138.58 3138.94 3140.81 3140.87 3146.30 3146.55 3151.63 3152.02 3155.12 3162.68 3163.19 3163.28 3163.41 3164.83 3167.80 3168.21 3172.30 3173.47 3176.36 3176.77 3182.02 3183.63 3183.65 3207.94 3208.29 3209.06 3209.60 3219.32 3220.42 3229.60 3230.23 3230.58 3264.09
frequency: 19.26 28.32 32.13 36.42 38.17 41.99 43.51 50.85 51.20 59.26 62.61 69.99 71.16 79.31 81.65 84.82 87.43 92.47 95.50 98.29 102.58 105.24 113.93 115.57 119.71 123.41 128.14 130.56 133.14 139.91 144.53 147.32 149.48 152.14 156.13 159.80 178.91 182.72 184.80 195.32 196.43 202.43 210.39 216.78 225.30 228.74 232.83 235.01 243.01 243.46 245.93 249.57 254.22 255.72 259.02 262.10 262.77 265.28 270.97 273.60 279.40 285.19 298.88 301.37 313.09 324.44 324.94 338.99 341.20 346.48 351.89 365.73 369.95 377.08 383.51 387.60 397.38 408.62 410.12 415.45 415.59 426.76 444.46 451.61 464.65 467.04 475.59 481.88 485.65 495.32 497.63 510.29 524.56 544.78 553.21 562.92 580.34 590.94 594.24 601.90 610.72 623.92 653.08 669.80 672.57 676.48 697.53 697.72 703.88 770.19 772.28 774.02 833.82 838.85 849.15 879.68 882.80 903.23 911.10 917.08 919.26 920.49 921.21 921.73 926.49 927.24 931.41 935.73 936.84 943.32 943.58 949.83 952.75 955.84 956.09 964.44 980.27 981.83 982.37 984.22 987.49 988.68 989.16 989.54 990.55 1022.24 1022.47 1022.90 1044.66 1045.28 1045.67 1062.59 1063.49 1064.22 1064.39 1064.65 1067.12 1069.92 1080.42 1089.14 1104.56 1105.43 1133.16 1141.60 1145.54 1147.71 1149.42 1154.99 1170.40 1170.57 1171.90 1190.98 1192.38 1193.26 1195.04 1195.52 1197.57 1231.56 1257.83 1260.12 1264.07 1278.11 1280.16 1284.18 1292.23 1292.40 1300.92 1302.54 1304.55 1310.65 1330.50 1337.94 1338.51 1340.36 1341.24 1342.30 1350.24 1354.11 1369.70 1384.73 1385.44 1401.75 1401.95 1402.41 1403.27 1404.99 1405.53 1406.99 1412.80 1412.90 1412.96 1413.36 1414.95 1415.65 1417.85 1419.22 1427.30 1439.11 1440.92 1441.67 1447.63 1458.25 1473.91 1474.54 1474.68 1476.06 1476.60 1478.33 1478.71 1481.16 1482.95 1483.23 1484.36 1485.06 1485.96 1486.47 1487.53 1488.20 1489.10 1489.91 1490.91 1492.06 1493.88 1494.19 1496.83 1499.92 1501.41 1501.80 1505.95 1507.48 1510.70 1517.34 1538.25 1541.07 1547.93 1641.98 1647.91 1648.78 1684.16 1684.60 1689.37 2403.78 3045.75 3047.30 3048.49 3050.96 3051.84 3052.80 3053.03 3053.54 3053.69 3054.54 3054.63 3056.20 3058.99 3060.93 3061.17 3064.80 3071.52 3080.58 3084.25 3113.95 3115.75 3121.73 3126.74 3132.39 3134.43 3134.50 3134.70 3134.70 3135.29 3135.58 3138.58 3138.94 3140.81 3140.87 3146.30 3146.55 3151.63 3152.02 3155.12 3162.68 3163.19 3163.28 3163.41 3164.83 3167.80 3168.21 3172.30 3173.47 3176.36 3176.77 3182.02 3183.63 3183.65 3207.94 3208.29 3209.06 3209.60 3219.32 3220.42 3229.60 3230.23 3230.58 3264.09
formula: C41H63ClFeN2P3
InChI: InChI=1/C39H60NP3.C2H3N.ClH.Fe/c1-25(2)41(26(3)4)37-22-31(13)16-19-34(37)40(35-20-17-32(14)23-38(35)42(27(5)6)28(7)8)36-21-18-33(15)24-39(36)43(29(9)10)30(11)12;1-2-3;;/h16-30H,1-15H3;1H3;1H;/q;;;+1/p-1/rC39H60ClFeNP3.C2H3N/c1-25(2)43(26(3)4)37-22-31(13)16-19-34(37)42-35-20-17-32(14)23-38(35)44(27(5)6,28(7)8)41(43,40)45(29(9)10,30(11)12)39-24-33(15)18-21-36(39)42;1-2-3/h16-30H,1-15H3;1H3
111 atoms
Fe -0.0321 -0.078857 0.071243
P  -0.747575 -2.216303 -0.712359
P  -1.625041 1.522919 -0.565122
P  2.036296 0.5396 -0.952476
Cl 0.076477 -0.186488 2.450876
N  -0.324248 -0.054083 -2.819137
C  0.248499 -1.305399 -3.181646
C  0.985522 -1.422827 -4.364262
H  1.117238 -0.546157 -4.996968
C  1.545535 -2.640369 -4.735854
H  2.122783 -2.706842 -5.659203
C  1.357776 -3.78217 -3.948617
C  0.604586 -3.652107 -2.776827
H  0.454658 -4.543057 -2.167703
C  0.066747 -2.43024 -2.355348
C  1.968735 -5.100584 -4.332052
H  1.928848 -5.260685 -5.418066
H  1.456457 -5.937494 -3.840124
H  3.028535 -5.143559 -4.036891
C  -1.739568 0.052762 -2.954173
C  -2.398276 -0.626359 -3.982993
H  -1.820265 -1.245343 -4.667944
C  -3.778622 -0.530402 -4.131054
H  -4.271881 -1.082793 -4.932104
C  -4.534633 0.27422 -3.272228
C  -3.860271 0.954117 -2.250493
H  -4.454741 1.561955 -1.568903
C  -2.478792 0.846945 -2.053608
C  -6.020102 0.419777 -3.446666
H  -6.253995 1.182585 -4.205521
H  -6.505334 0.728333 -2.511601
H  -6.478858 -0.520471 -3.780541
C  0.405793 1.117051 -3.178323
C  -0.048154 1.910273 -4.23815
H  -0.926215 1.592215 -4.79849
C  0.580901 3.107663 -4.55985
H  0.196018 3.714882 -5.380244
C  1.694212 3.539012 -3.831278
C  2.153713 2.721449 -2.793315
H  3.008337 3.076097 -2.224433
C  1.540845 1.51152 -2.442737
C  2.389307 4.829565 -4.161875
H  3.012192 5.173952 -3.326496
H  1.668394 5.621825 -4.405056
H  3.046122 4.710066 -5.037267
C  -0.103997 -3.684777 0.261721
H  -0.387858 -4.606744 -0.268825
C  1.416177 -3.599992 0.37619
H  1.695815 -2.72873 0.983994
H  1.924869 -3.512962 -0.590854
H  1.802742 -4.497995 0.881719
C  -0.686841 -3.729367 1.677027
H  -0.157827 -4.500995 2.257445
H  -1.751118 -3.976172 1.702921
H  -0.543933 -2.766198 2.186871
C  -2.536599 -2.658491 -1.144296
H  -2.902751 -1.71917 -1.579762
C  -2.672696 -3.75531 -2.194597
H  -2.224825 -4.701233 -1.854413
H  -2.203392 -3.481463 -3.1472
H  -3.739412 -3.947418 -2.390087
C  -3.41482 -2.978942 0.063654
H  -4.471408 -2.850724 -0.21575
H  -3.221122 -2.336235 0.929291
H  -3.289554 -4.02293 0.380522
C  -3.023726 1.762783 0.651691
H  -3.819078 2.349542 0.169301
C  -3.575819 0.401235 1.057322
H  -2.788222 -0.201499 1.528813
H  -3.965478 -0.16157 0.19986
H  -4.395177 0.521729 1.782861
C  -2.541177 2.531671 1.881779
H  -3.318884 2.502567 2.660234
H  -2.339033 3.586483 1.662144
H  -1.630793 2.079185 2.300188
C  -1.18762 3.264893 -1.124097
H  -0.661437 3.074749 -2.068543
C  -2.3889 4.151421 -1.429128
H  -2.944688 4.418919 -0.519114
H  -3.087618 3.666705 -2.125101
H  -2.053169 5.09053 -1.895759
C  -0.18878 3.934482 -0.184404
H  0.261446 4.810035 -0.67614
H  0.622467 3.246538 0.085624
H  -0.656718 4.28237 0.744827
C  3.136291 1.741964 -0.006496
H  2.568407 2.681779 -0.082888
C  4.557649 2.007163 -0.507313
H  4.973615 2.864741 0.043623
H  4.623791 2.240217 -1.575498
H  5.21756 1.152553 -0.31609
C  3.173884 1.361399 1.474183
H  3.73586 0.4308 1.636008
H  2.168408 1.214481 1.88807
H  3.679004 2.154922 2.046303
C  3.16866 -0.797914 -1.647443
H  2.441048 -1.551157 -1.976954
C  4.008521 -0.412971 -2.860086
H  4.793657 0.311328 -2.610453
H  3.394655 0.01398 -3.663436
H  4.502472 -1.311415 -3.262238
C  4.013841 -1.439827 -0.5484
H  4.41547 -2.399655 -0.906586
H  3.43252 -1.644225 0.358792
H  4.869148 -0.814201 -0.264885
C  -3.251775 -1.484881 4.232622
N  -3.681783 -2.466228 3.790955
C  -2.696672 -0.255708 4.765612
H  -1.746822 -0.043198 4.251235
H  -2.51743 -0.355968 5.843831
H  -3.390503 0.577023 4.593017
elementType: Fe P Cl N C H
totalener: -4466.89254868127591 hartree
nucrepener: 9393.22551459309943 hartree
cpcmener: -0.04131735959118 hartree
kineticenergy: 4540.22273851769023 hartree
exchangeener: -298.356759120057 hartree
correlationener: -14.321105159795 hartree
xcener: -312.677864279852 hartree
s2: 3.822253
dispersion: -0.191129806 hartree
s2: 3.818966
dispersion: -0.190436923 hartree
s2: 3.815338
dispersion: -0.190103819 hartree
s2: 3.812711
dispersion: -0.190705781 hartree
s2: 3.810107
dispersion: -0.191278844 hartree
s2: 3.808225
dispersion: -0.191811160 hartree
s2: 3.808061
dispersion: -0.192093819 hartree
s2: 3.808653
dispersion: -0.191931471 hartree
s2: 3.808740
dispersion: -0.191676797 hartree
s2: 3.808590
dispersion: -0.191843514 hartree
s2: 3.808282
dispersion: -0.191939561 hartree
s2: 3.807804
dispersion: -0.192061535 hartree
s2: 3.807186
dispersion: -0.192401289 hartree
s2: 3.806658
dispersion: -0.192503788 hartree
s2: 3.806460
dispersion: -0.192529462 hartree
s2: 3.806490
dispersion: -0.192320887 hartree
s2: 3.806477
dispersion: -0.192443191 hartree
s2: 3.806656
dispersion: -0.192377993 hartree
s2: 3.806632
dispersion: -0.192384590 hartree
s2: 3.806789
dispersion: -0.192291279 hartree
s2: 3.806811
dispersion: -0.192361578 hartree
s2: 3.806733
dispersion: -0.192462234 hartree
s2: 3.806791
dispersion: -0.192473595 hartree
s2: 3.806858
dispersion: -0.192578579 hartree
s2: 3.806937
dispersion: -0.192762244 hartree
s2: 3.807122
dispersion: -0.193053441 hartree
s2: 3.807112
dispersion: -0.193063087 hartree
s2: 3.806949
dispersion: -0.193008949 hartree
s2: 3.806907
dispersion: -0.193044328 hartree
s2: 3.806857
dispersion: -0.193000443 hartree
s2: 3.806804
dispersion: -0.193033274 hartree
s2: 3.806737
dispersion: -0.192995634 hartree
s2: 3.806666
dispersion: -0.192937668 hartree
s2: 3.806648
dispersion: -0.192929003 hartree
s2: 3.806652
dispersion: -0.192942299 hartree
s2: 3.806639
dispersion: -0.192966579 hartree
s2: 3.806637
dispersion: -0.192970324 hartree
dispersion: -0.192977642 hartree
s2: 3.806640
energy: -7034.2448 -2774.8658 -2106.9646 -2106.9115 -2106.8462 -831.2795 -707.0340 -706.7764 -706.7252 -392.5856 -391.5499 -279.7109 -279.6211 -279.6157 -279.5947 -278.8169 -278.7534 -278.7147 -278.7071 -278.6890 -278.6830 -278.6825 -278.5633 -278.4804 -278.4520 -278.4333 -278.4315 -278.4288 -278.4264 -278.4248 -278.4230 -278.4170 -278.4066 -278.4063 -278.4017 -278.3892 -278.3764 -277.9388 -277.9343 -277.9304 -277.8072 -277.7700 -277.7602 -277.7328 -277.7179 -277.7142 -277.7061 -277.7034 -277.6913 -277.6673 -277.6092 -277.5844 -258.8323 -195.6480 -195.6058 -195.6021 -181.0132 -180.9598 -180.9043 -129.5111 -129.4948 -129.4579 -129.4392 -129.4108 -129.4021 -129.3821 -129.3594 -129.3041 -96.6794 -61.8064 -61.1917 -61.0711 -27.0969 -25.1856 -24.0983 -24.0797 -23.6086 -22.4142 -22.3879 -22.3706 -21.7333 -21.7145 -21.6229 -21.5988 -21.5819 -21.1195 -20.9398 -20.8876 -20.8668 -20.8623 -20.4366 -19.3064 -19.2881 -18.9696 -18.9208 -18.9095 -18.8239 -18.7875 -18.6498 -18.4562 -18.1793 -18.1396 -18.0782 -17.0880 -17.0726 -17.0340 -16.3538 -16.3285 -16.1322 -16.0427 -16.0164 -15.6906 -15.0869 -15.0604 -14.7184 -14.5887 -14.5216 -13.9527 -13.8867 -13.3536 -13.3232 -13.2881 -13.0476 -12.9914 -12.9403 -12.8041 -12.7294 -12.5811 -12.5620 -12.5523 -12.5331 -12.5231 -12.3659 -12.2767 -12.2138 -12.1621 -12.1244 -12.0826 -11.8797 -11.8318 -11.8048 -11.7980 -11.7162 -11.6483 -11.5036 -11.4302 -11.3848 -11.3536 -11.1253 -11.1222 -11.0573 -10.8542 -10.8388 -10.7961 -10.7514 -10.7094 -10.6741 -10.6265 -10.6003 -10.5851 -10.5564 -10.5305 -10.5180 -10.4062 -10.3451 -10.2594 -10.1801 -9.9844 -9.9624 -9.8933 -9.7710 -9.7003 -9.6743 -9.6687 -9.5896 -9.5318 -9.5210 -9.4856 -9.4560 -9.3969 -9.3796 -9.3662 -9.2808 -9.0797 -8.8430 -8.7977 -8.7842 -8.4818 -8.3542 -8.3338 -8.2675 -8.0985 -8.0642 -8.0194 -7.5956 -7.5181 -7.4321 -7.3709 -7.3341 -7.1545 -7.1288 -6.0709 -5.9277 -5.8878 -5.5506 -5.3288 -5.1949 -0.8389 -0.8028 -0.7684 -0.2423 -0.2150 0.3190 1.0147 1.0970 1.1447 1.3793 1.5004 electronvolt
energy: -7034.2366 -2774.8570 -2106.9662 -2106.9126 -2106.8473 -829.7241 -705.5559 -705.5220 -705.5083 -392.5701 -391.5499 -279.7109 -279.6211 -279.6155 -279.5946 -278.8166 -278.7543 -278.7142 -278.7068 -278.6887 -278.6838 -278.6831 -278.5612 -278.4790 -278.4529 -278.4337 -278.4334 -278.4314 -278.4263 -278.4259 -278.4253 -278.4173 -278.4071 -278.4067 -278.4020 -278.3897 -278.3802 -277.9389 -277.9342 -277.9304 -277.8062 -277.7697 -277.7600 -277.7318 -277.7178 -277.7134 -277.7056 -277.7035 -277.6908 -277.6663 -277.6088 -277.5845 -258.8236 -195.6426 -195.5897 -195.5861 -181.0147 -180.9606 -180.9051 -129.5119 -129.4966 -129.4583 -129.4406 -129.4163 -129.4025 -129.3835 -129.3638 -129.3085 -92.6723 -57.0926 -57.0842 -56.9553 -27.0785 -25.1855 -24.0985 -24.0797 -23.6067 -22.4120 -22.3864 -22.3688 -21.7323 -21.7136 -21.6229 -21.5991 -21.5817 -21.1181 -20.9403 -20.8883 -20.8670 -20.8604 -20.3694 -19.3056 -19.2874 -18.9685 -18.9200 -18.9084 -18.8224 -18.7866 -18.6492 -18.4543 -18.1775 -18.1367 -18.0749 -17.0876 -17.0722 -17.0300 -16.3532 -16.3277 -16.1331 -16.0418 -16.0159 -15.6889 -15.0848 -15.0581 -14.7080 -14.5823 -14.5143 -13.9522 -13.8742 -13.3527 -13.3225 -13.2861 -13.0454 -12.9887 -12.9373 -12.8014 -12.7266 -12.5804 -12.5616 -12.5510 -12.5316 -12.5227 -12.3645 -12.2747 -12.2124 -12.1599 -12.1220 -12.0796 -11.8786 -11.8301 -11.8043 -11.7964 -11.7157 -11.6461 -11.4949 -11.4196 -11.3752 -11.3495 -11.1174 -11.1147 -11.0519 -10.8533 -10.8382 -10.7923 -10.7505 -10.7023 -10.6723 -10.6221 -10.5915 -10.5826 -10.5529 -10.5244 -10.5175 -10.4036 -10.3409 -10.2566 -10.1754 -9.9828 -9.9601 -9.8908 -9.7689 -9.6954 -9.6658 -9.6593 -9.5870 -9.5246 -9.5177 -9.4806 -9.4435 -9.3903 -9.3751 -9.3609 -9.2744 -9.0122 -8.8070 -8.7861 -8.6863 -8.3090 -8.2917 -8.2071 -8.1025 -7.6663 -7.5551 -7.5364 -7.3854 -7.3326 -7.2424 -7.2316 -7.2069 -6.7425 -6.7238 -5.8804 -4.0083 -3.9803 -0.8820 -0.8293 -0.7848 -0.2384 -0.2128 0.2480 0.5020 0.5277 0.5862 1.0747 1.1221 electronvolt
chargesum: 0.0000000
charge: -0.036832 0.448501 0.444803 0.463489 -0.423241 -0.375971 0.101629 -0.183052 0.184833 -0.220155 0.171910 0.059954 -0.302688 0.177387 -0.103959 -0.484632 0.189399 0.189567 0.197889 0.083194 -0.180095 0.186957 -0.223206 0.172806 0.053902 -0.302813 0.177418 -0.074225 -0.483883 0.198138 0.189387 0.190031 0.070081 -0.178912 0.184257 -0.224501 0.173300 0.062657 -0.305322 0.177908 -0.074906 -0.485037 0.189805 0.190724 0.198111 -0.421566 0.207553 -0.517912 0.198711 0.208054 0.181518 -0.482995 0.173769 0.177323 0.169416 -0.437113 0.245976 -0.468012 0.178672 0.193506 0.175762 -0.497947 0.179434 0.200769 0.189590 -0.422473 0.209220 -0.534724 0.212077 0.203708 0.182114 -0.490250 0.182400 0.191925 0.174568 -0.438751 0.247335 -0.469062 0.182567 0.183488 0.177998 -0.490675 0.176855 0.216470 0.176985 -0.479029 0.228536 -0.476877 0.179909 0.200501 0.187956 -0.481290 0.173911 0.190201 0.173574 -0.457315 0.250053 -0.454563 0.177927 0.189256 0.172411 -0.488242 0.182069 0.199840 0.186443 -0.037902 -0.186893 -0.530153 0.219381 0.242711 0.246699
charge: -1.466475 0.829576 0.843583 0.833139 -0.092342 -0.001724 0.001573 -0.155074 0.160640 -0.140532 0.156677 -0.059699 -0.143076 0.153271 -0.162539 -0.386074 0.153881 0.151825 0.159037 0.002555 -0.155508 0.161404 -0.141888 0.157118 -0.059250 -0.146807 0.152839 -0.163346 -0.386010 0.159272 0.152130 0.153962 -0.000690 -0.157466 0.161903 -0.143884 0.157318 -0.057299 -0.147792 0.154306 -0.157785 -0.385811 0.151799 0.154650 0.159362 -0.288834 0.143735 -0.396311 0.144662 0.139811 0.144362 -0.407032 0.141391 0.138164 0.132511 -0.289905 0.154005 -0.397794 0.138786 0.139866 0.142014 -0.398514 0.144018 0.138197 0.139939 -0.287062 0.143048 -0.397450 0.146234 0.140516 0.141990 -0.400479 0.143161 0.138819 0.137644 -0.294083 0.157352 -0.399026 0.140282 0.140609 0.143505 -0.396126 0.142643 0.141628 0.138832 -0.295007 0.150559 -0.400459 0.146375 0.139174 0.140958 -0.403740 0.138705 0.138024 0.140566 -0.290835 0.155411 -0.398199 0.139358 0.139614 0.141825 -0.396588 0.145061 0.142078 0.138304 -0.004864 -0.164964 -0.424077 0.165576 0.191259 0.190026
qa: -0.0368 0.4485 0.4448 0.4635 -0.4232 -0.3760 0.1016 -0.1831 0.1848 -0.2202 0.1719 0.0600 -0.3027 0.1774 -0.1040 -0.4846 0.1894 0.1896 0.1979 0.0832 -0.1801 0.1870 -0.2232 0.1728 0.0539 -0.3028 0.1774 -0.0742 -0.4839 0.1981 0.1894 0.1900 0.0701 -0.1789 0.1843 -0.2245 0.1733 0.0627 -0.3053 0.1779 -0.0749 -0.4850 0.1898 0.1907 0.1981 -0.4216 0.2076 -0.5179 0.1987 0.2081 0.1815 -0.4830 0.1738 0.1773 0.1694 -0.4371 0.2460 -0.4680 0.1787 0.1935 0.1758 -0.4979 0.1794 0.2008 0.1896 -0.4225 0.2092 -0.5347 0.2121 0.2037 0.1821 -0.4902 0.1824 0.1919 0.1746 -0.4388 0.2473 -0.4691 0.1826 0.1835 0.1780 -0.4907 0.1769 0.2165 0.1770 -0.4790 0.2285 -0.4769 0.1799 0.2005 0.1880 -0.4813 0.1739 0.1902 0.1736 -0.4573 0.2501 -0.4546 0.1779 0.1893 0.1724 -0.4882 0.1821 0.1998 0.1864 -0.0379 -0.1869 -0.5302 0.2194 0.2427 0.2467
va: 5.5225 3.6748 3.7037 3.6553 1.0741 3.0897 3.9990 3.7989 0.9399 3.8222 0.9412 3.8956 3.8871 0.9446 3.8278 3.8174 0.9288 0.9322 0.9219 4.0034 3.7948 0.9379 3.8230 0.9410 3.9028 3.8941 0.9466 3.8270 3.8180 0.9218 0.9320 0.9291 4.0143 3.7914 0.9390 3.8180 0.9405 3.9029 3.8882 0.9476 3.8252 3.8189 0.9327 0.9280 0.9219 3.9137 0.9089 3.7800 0.9477 0.9254 0.9303 3.7741 0.9333 0.9496 1.0004 3.9098 0.8752 3.8023 0.9353 0.9296 0.9327 3.8047 0.9294 0.9444 0.9254 3.9286 0.9085 3.7675 0.9571 0.9252 0.9291 3.7792 0.9328 0.9310 0.9819 3.9020 0.8738 3.8119 0.9334 0.9361 0.9306 3.7948 0.9320 0.9354 0.9405 3.9169 0.9018 3.7869 0.9306 0.9258 0.9381 3.7805 0.9393 0.9861 0.9318 3.9188 0.8707 3.7980 0.9388 0.9326 0.9348 3.7973 0.9295 0.9322 0.9362 4.0375 3.0577 3.7831 1.0012 0.9134 0.9163
dispersion: -0.192977771 hartree
energy: -4467.104248920557 hartree
dipole: 4.946866508 -4.436532829 0.510333679 3.275026676 -1.499590292 1.775436384 -4.575209743 0.363351185 -4.211858558
dipolemethod: SCF
magnitude: 4.599170288 au
magnitude: 11.690161839 debye
temp: 298.15 k
press: 1.00 atm
zeropoint: 0.96010765 hartree
thermalvibcorrection: 0.05538230 hartree
thermalrotcorrection: 0.00141627 hartree
thermaltrasncorrection: 0.00141627 hartree
thermaltotal: -4466.08592643 hartree
thermalcorr: 0.05821484 hartree
nonthermalcorr: 0.96010765 hartree
totalcorr: 1.01832249 hartree
thermalcorrenthalpy: 0.00094421 hartree
totalenthalpy: -4466.08498222 hartree
vibrat: 0.09967743 hartree
rotat: 0.01833556 hartree
transl: 0.02175884 hartree
total: 0.14108074 hartree
totalentropycorr: -0.14108074 hartree
gibbsenthalpy: -4466.22606296 hartree
gibbsminuselec: 0.87818596 hartree
