program: Orca
programVersion: 6.1.x
elementType: Fe P P P N C C H C H C C H C C H H H C C H C H C C H C C H H H C C H C H C C H C C H H H C H C H H H C H H H C H C H H H C H H H C H C H H H C H H H C H C H H H C H H H C H C H H H C H H H C H C H H H C H H H C N C H H H Cl
keywords: PBE0 D4 DKH2 DKH-def2-SV(P) def2-tzvp/c Opt Freq UNO UCO NormalPrint CPCM(acetonitrile)
charge: 0
multiplicity: 4
frequency: 0.00 0.00 0.00 0.00 0.00 0.00 -10.27 19.42 22.85 27.85 30.36 33.09 38.20 41.39 43.00 49.87 52.16 58.79 63.65 69.51 75.30 77.76 79.71 84.04 88.85 93.49 95.96 102.03 105.30 110.78 112.35 121.53 123.54 124.74 130.06 135.67 143.31 146.45 147.47 150.62 156.30 163.66 172.76 173.34 173.86 183.69 186.60 189.02 198.04 204.84 210.25 215.47 224.30 225.17 230.15 231.67 239.11 240.67 244.46 248.72 250.40 252.70 255.23 257.69 259.61 265.90 268.71 274.93 279.01 282.30 296.91 299.32 309.29 320.64 327.41 332.59 342.28 347.43 353.96 364.14 368.65 376.13 383.92 388.86 398.69 409.00 411.83 423.20 426.49 428.10 445.21 450.16 467.16 467.92 473.59 481.60 486.98 494.53 499.09 509.86 523.60 544.77 551.07 562.60 581.76 590.04 594.06 605.65 611.80 626.20 655.72 672.87 674.86 677.63 697.51 698.01 704.14 770.99 772.91 773.59 834.96 839.70 850.50 880.07 883.21 904.19 909.86 917.58 919.28 919.46 920.09 922.97 924.05 927.83 930.29 937.34 938.55 942.86 945.76 947.14 948.96 955.33 956.32 978.27 981.43 982.13 983.16 984.34 989.07 990.12 990.46 991.40 993.07 1022.48 1023.19 1023.75 1042.60 1044.86 1045.08 1053.53 1063.88 1064.07 1064.42 1065.35 1066.33 1070.22 1079.21 1089.69 1105.34 1106.10 1143.35 1143.79 1144.70 1147.72 1149.93 1151.46 1170.49 1172.97 1173.19 1187.79 1191.78 1192.32 1192.80 1193.63 1195.44 1232.55 1257.71 1260.04 1264.03 1277.77 1279.25 1283.06 1294.29 1295.01 1301.85 1302.79 1305.42 1309.45 1332.02 1337.23 1337.96 1339.46 1346.68 1347.26 1349.17 1350.55 1370.47 1385.79 1386.64 1390.35 1402.66 1403.37 1404.91 1405.44 1406.23 1407.30 1412.40 1413.30 1413.67 1414.56 1414.93 1417.23 1418.88 1422.04 1426.52 1437.83 1440.28 1441.76 1443.17 1455.97 1473.84 1474.40 1474.55 1475.05 1476.27 1477.85 1478.15 1479.65 1480.67 1482.57 1483.41 1484.05 1484.86 1485.25 1486.08 1486.50 1486.67 1487.23 1490.33 1491.03 1492.32 1493.08 1494.75 1496.26 1499.98 1502.98 1504.05 1508.46 1509.80 1518.00 1539.04 1541.75 1549.00 1643.16 1649.35 1649.88 1685.21 1686.31 1690.65 2383.06 2973.81 3047.46 3048.63 3054.29 3054.43 3055.27 3055.46 3056.47 3056.55 3056.80 3057.33 3059.13 3063.00 3063.91 3064.07 3067.93 3082.63 3085.56 3086.97 3104.98 3115.81 3124.78 3127.36 3129.54 3135.26 3135.60 3135.71 3136.38 3137.45 3138.49 3138.72 3139.11 3142.48 3143.07 3147.56 3149.19 3149.49 3153.32 3154.61 3163.56 3164.21 3164.29 3164.65 3166.73 3171.91 3172.15 3173.07 3173.50 3175.81 3176.52 3176.88 3180.25 3185.57 3199.10 3209.40 3210.73 3210.87 3220.78 3224.38 3230.05 3232.21 3232.52 3260.06
frequency: 19.42 22.85 27.85 30.36 33.09 38.20 41.39 43.00 49.87 52.16 58.79 63.65 69.51 75.30 77.76 79.71 84.04 88.85 93.49 95.96 102.03 105.30 110.78 112.35 121.53 123.54 124.74 130.06 135.67 143.31 146.45 147.47 150.62 156.30 163.66 172.76 173.34 173.86 183.69 186.60 189.02 198.04 204.84 210.25 215.47 224.30 225.17 230.15 231.67 239.11 240.67 244.46 248.72 250.40 252.70 255.23 257.69 259.61 265.90 268.71 274.93 279.01 282.30 296.91 299.32 309.29 320.64 327.41 332.59 342.28 347.43 353.96 364.14 368.65 376.13 383.92 388.86 398.69 409.00 411.83 423.20 426.49 428.10 445.21 450.16 467.16 467.92 473.59 481.60 486.98 494.53 499.09 509.86 523.60 544.77 551.07 562.60 581.76 590.04 594.06 605.65 611.80 626.20 655.72 672.87 674.86 677.63 697.51 698.01 704.14 770.99 772.91 773.59 834.96 839.70 850.50 880.07 883.21 904.19 909.86 917.58 919.28 919.46 920.09 922.97 924.05 927.83 930.29 937.34 938.55 942.86 945.76 947.14 948.96 955.33 956.32 978.27 981.43 982.13 983.16 984.34 989.07 990.12 990.46 991.40 993.07 1022.48 1023.19 1023.75 1042.60 1044.86 1045.08 1053.53 1063.88 1064.07 1064.42 1065.35 1066.33 1070.22 1079.21 1089.69 1105.34 1106.10 1143.35 1143.79 1144.70 1147.72 1149.93 1151.46 1170.49 1172.97 1173.19 1187.79 1191.78 1192.32 1192.80 1193.63 1195.44 1232.55 1257.71 1260.04 1264.03 1277.77 1279.25 1283.06 1294.29 1295.01 1301.85 1302.79 1305.42 1309.45 1332.02 1337.23 1337.96 1339.46 1346.68 1347.26 1349.17 1350.55 1370.47 1385.79 1386.64 1390.35 1402.66 1403.37 1404.91 1405.44 1406.23 1407.30 1412.40 1413.30 1413.67 1414.56 1414.93 1417.23 1418.88 1422.04 1426.52 1437.83 1440.28 1441.76 1443.17 1455.97 1473.84 1474.40 1474.55 1475.05 1476.27 1477.85 1478.15 1479.65 1480.67 1482.57 1483.41 1484.05 1484.86 1485.25 1486.08 1486.50 1486.67 1487.23 1490.33 1491.03 1492.32 1493.08 1494.75 1496.26 1499.98 1502.98 1504.05 1508.46 1509.80 1518.00 1539.04 1541.75 1549.00 1643.16 1649.35 1649.88 1685.21 1686.31 1690.65 2383.06 2973.81 3047.46 3048.63 3054.29 3054.43 3055.27 3055.46 3056.47 3056.55 3056.80 3057.33 3059.13 3063.00 3063.91 3064.07 3067.93 3082.63 3085.56 3086.97 3104.98 3115.81 3124.78 3127.36 3129.54 3135.26 3135.60 3135.71 3136.38 3137.45 3138.49 3138.72 3139.11 3142.48 3143.07 3147.56 3149.19 3149.49 3153.32 3154.61 3163.56 3164.21 3164.29 3164.65 3166.73 3171.91 3172.15 3173.07 3173.50 3175.81 3176.52 3176.88 3180.25 3185.57 3199.10 3209.40 3210.73 3210.87 3220.78 3224.38 3230.05 3232.21 3232.52 3260.06
formula: C41H63ClFeN2P3
InChI: InChI=1/C39H60NP3.C2H3N.Cl.Fe/c1-25(2)41(26(3)4)37-22-31(13)16-19-34(37)40(35-20-17-32(14)23-38(35)42(27(5)6)28(7)8)36-21-18-33(15)24-39(36)43(29(9)10)30(11)12;1-2-3;;/h16-30H,1-15H3;1H3;;/rC41H63FeN2P3.Cl/c1-17-43-42-45(27(2)3,28(4)5)39-24-33(14)18-21-36(39)44(37-22-19-34(15)25-40(37)46(42,29(6)7)30(8)9)38-23-20-35(16)26-41(38)47(42,31(10)11)32(12)13;/h18-32H,1-16H3;
111 atoms
Fe -0.309134 1.446195 2.775794
P  -1.032302 -0.684054 1.936417
P  -1.870448 3.083014 2.136587
P  1.783346 2.115924 1.82204
N  -0.512335 1.534443 -0.108646
C  0.07063 0.286409 -0.467526
C  0.863919 0.190647 -1.615893
H  1.026826 1.078695 -2.224643
C  1.440369 -1.019072 -1.986428
H  2.060118 -1.065993 -2.882955
C  1.216598 -2.176534 -1.232697
C  0.409583 -2.068618 -0.095473
H  0.236953 -2.971492 0.488785
C  -0.151376 -0.856397 0.324248
C  1.845756 -3.487148 -1.612542
H  1.855106 -3.626517 -2.702051
H  1.312893 -4.333351 -1.160147
H  2.891186 -3.534805 -1.270711
C  -1.92279 1.650997 -0.279604
C  -2.55553 1.000528 -1.341922
H  -1.961875 0.393439 -2.024227
C  -3.928941 1.120594 -1.532713
H  -4.403332 0.596287 -2.363362
C  -4.700858 1.920312 -0.684001
C  -4.050203 2.577921 0.367536
H  -4.655434 3.193051 1.032941
C  -2.678794 2.44266 0.609006
C  -6.187678 2.043208 -0.862119
H  -6.482145 1.873938 -1.906073
H  -6.547874 3.034317 -0.556105
H  -6.718025 1.299561 -0.247276
C  0.233527 2.699931 -0.450488
C  -0.189057 3.506254 -1.513338
H  -1.072594 3.217369 -2.080597
C  0.486333 4.677846 -1.834555
H  0.127643 5.296128 -2.658522
C  1.618421 5.066682 -1.109923
C  2.037521 4.242464 -0.060661
H  2.905702 4.56348 0.50831
C  1.368115 3.065408 0.297891
C  2.370349 6.320697 -1.455286
H  3.020003 6.638192 -0.629815
H  1.685011 7.145489 -1.693012
H  3.008427 6.165429 -2.338774
C  -0.404041 -2.164713 2.897253
H  -0.573922 -3.069606 2.295436
C  1.092493 -1.984996 3.136168
H  1.270051 -1.109872 3.776534
H  1.661928 -1.848224 2.209358
H  1.498485 -2.867055 3.653797
C  -1.112048 -2.345298 4.240969
H  -0.516952 -3.024868 4.869677
H  -2.107517 -2.786691 4.14018
H  -1.229961 -1.403714 4.793032
C  -2.812752 -1.079947 1.457103
H  -3.148731 -0.127236 1.026609
C  -2.932696 -2.156762 0.384313
H  -2.51146 -3.114911 0.724083
H  -2.42776 -1.874517 -0.547594
H  -3.99541 -2.327023 0.151711
C  -3.731665 -1.404683 2.636119
H  -4.772264 -1.201284 2.342546
H  -3.525143 -0.826795 3.544405
H  -3.674168 -2.469215 2.897835
C  -3.304197 3.330695 3.306077
H  -4.052187 3.969918 2.815013
C  -3.933799 1.983782 3.641032
H  -3.242753 1.358345 4.22176
H  -4.238257 1.425437 2.747409
H  -4.827574 2.131979 4.266186
C  -2.843452 4.028934 4.585963
H  -3.639072 3.966938 5.343385
H  -2.623727 5.090951 4.429041
H  -1.94728 3.550238 5.006837
C  -1.348021 4.813843 1.63386
H  -0.724584 4.615001 0.753004
C  -2.499211 5.712434 1.200363
H  -3.159146 5.967406 2.04204
H  -3.109322 5.244415 0.41566
H  -2.103767 6.656745 0.795592
C  -0.454924 5.480878 2.678074
H  0.12697 6.288322 2.209532
H  0.253646 4.771639 3.12525
H  -1.036851 5.926954 3.493786
C  2.780938 3.360076 2.826847
H  2.240626 4.298298 2.631378
C  4.252973 3.592041 2.482408
H  4.615007 4.461622 3.051731
H  4.436848 3.7969 1.4222
H  4.87897 2.738088 2.766583
C  2.63188 3.056932 4.31779
H  3.071141 2.085026 4.582916
H  1.579658 3.043696 4.624676
H  3.150532 3.828717 4.90649
C  2.963591 0.775433 1.234194
H  2.264898 0.014426 0.859645
C  3.886071 1.153393 0.081191
H  4.636226 1.897883 0.375108
H  3.325392 1.552526 -0.773698
H  4.42443 0.257063 -0.264025
C  3.726704 0.157614 2.405248
H  4.141714 -0.815064 2.102361
H  3.085382 -0.014296 3.278271
H  4.566943 0.78495 2.726361
C  -0.238988 1.158503 5.91316
N  -0.229409 1.274241 4.759977
C  -0.312108 0.993138 7.345639
H  0.483508 0.321522 7.694129
H  -1.304459 0.550308 7.558658
H  -0.212425 1.964563 7.847784
Cl -3.389574 -0.362091 6.724042
elementType: Fe P N C H Cl
totalener: -4466.88688474991977 hartree
nucrepener: 9366.19733249745150 hartree
cpcmener: -0.08194127155771 hartree
kineticenergy: 4540.14463313844863 hartree
exchangeener: -298.370422682852 hartree
correlationener: -14.315624409979 hartree
xcener: -312.686047092831 hartree
s2: 3.801268
dispersion: -0.191256918 hartree
s2: 3.800158
dispersion: -0.191106606 hartree
s2: 3.798549
dispersion: -0.190964886 hartree
s2: 3.797192
dispersion: -0.191678136 hartree
s2: 3.796337
dispersion: -0.192127367 hartree
s2: 3.796084
dispersion: -0.192556352 hartree
s2: 3.795812
dispersion: -0.193095649 hartree
s2: 3.795281
dispersion: -0.193432003 hartree
s2: 3.795182
dispersion: -0.193194616 hartree
s2: 3.795443
dispersion: -0.192910565 hartree
s2: 3.795550
dispersion: -0.192789035 hartree
s2: 3.795525
dispersion: -0.192954691 hartree
s2: 3.795454
dispersion: -0.192889367 hartree
s2: 3.795460
dispersion: -0.192874395 hartree
s2: 3.795426
dispersion: -0.192843824 hartree
s2: 3.795446
dispersion: -0.192760067 hartree
s2: 3.795441
dispersion: -0.192776297 hartree
s2: 3.795448
dispersion: -0.192794922 hartree
s2: 3.795447
dispersion: -0.192834398 hartree
s2: 3.795439
dispersion: -0.192846238 hartree
s2: 3.795429
dispersion: -0.192850903 hartree
s2: 3.795415
dispersion: -0.192834292 hartree
s2: 3.795388
dispersion: -0.192816046 hartree
s2: 3.795343
dispersion: -0.192787673 hartree
s2: 3.795345
dispersion: -0.192763791 hartree
s2: 3.795407
dispersion: -0.192765036 hartree
s2: 3.795461
dispersion: -0.192793243 hartree
s2: 3.795537
dispersion: -0.192835728 hartree
s2: 3.795638
dispersion: -0.192883283 hartree
s2: 3.795784
dispersion: -0.192982131 hartree
s2: 3.795772
dispersion: -0.192969761 hartree
s2: 3.795808
dispersion: -0.193052964 hartree
s2: 3.795765
dispersion: -0.192964557 hartree
s2: 3.795727
dispersion: -0.192919161 hartree
s2: 3.795683
dispersion: -0.192884199 hartree
s2: 3.795648
dispersion: -0.192871489 hartree
s2: 3.795625
dispersion: -0.192869467 hartree
s2: 3.795623
dispersion: -0.192877539 hartree
s2: 3.795618
dispersion: -0.192913055 hartree
s2: 3.795596
dispersion: -0.192895562 hartree
s2: 3.795635
dispersion: -0.192894612 hartree
s2: 3.795671
dispersion: -0.192833112 hartree
s2: 3.795694
dispersion: -0.192778184 hartree
s2: 3.795713
dispersion: -0.192749791 hartree
s2: 3.795718
dispersion: -0.192741935 hartree
s2: 3.795704
dispersion: -0.192732084 hartree
s2: 3.795686
dispersion: -0.192740705 hartree
s2: 3.795687
dispersion: -0.192740587 hartree
s2: 3.795684
dispersion: -0.192747174 hartree
s2: 3.795682
dispersion: -0.192759484 hartree
s2: 3.795668
dispersion: -0.192766886 hartree
s2: 3.795693
dispersion: -0.192786977 hartree
s2: 3.795685
dispersion: -0.192778024 hartree
s2: 3.795688
dispersion: -0.192776547 hartree
dispersion: -0.192783073 hartree
s2: 3.795691
dispersion: -0.192793366 hartree
s2: 3.795699
dispersion: -0.192806772 hartree
s2: 3.795715
dispersion: -0.192813934 hartree
s2: 3.795726
dispersion: -0.192807179 hartree
s2: 3.795734
dispersion: -0.192794942 hartree
s2: 3.795740
dispersion: -0.192785925 hartree
s2: 3.795743
dispersion: -0.192782999 hartree
dispersion: -0.192782766 hartree
dispersion: -0.192787226 hartree
dispersion: -0.192794326 hartree
s2: 3.795745
dispersion: -0.192796690 hartree
s2: 3.795750
dispersion: -0.192807666 hartree
s2: 3.795755
dispersion: -0.192812712 hartree
s2: 3.795756
dispersion: -0.192814596 hartree
s2: 3.795764
dispersion: -0.192817757 hartree
s2: 3.795758
dispersion: -0.192805581 hartree
dispersion: -0.192808870 hartree
dispersion: -0.192807033 hartree
s2: 3.795768
energy: -7034.5566 -2773.3063 -2107.0949 -2107.0533 -2106.9959 -831.6064 -707.2212 -707.1789 -707.1165 -392.6848 -392.2670 -280.1533 -279.6994 -279.6869 -279.6826 -278.8241 -278.7777 -278.7748 -278.7734 -278.7644 -278.7559 -278.7301 -278.6611 -278.5660 -278.5639 -278.5311 -278.5171 -278.5137 -278.5123 -278.4959 -278.4916 -278.4904 -278.4757 -278.4738 -278.4569 -278.4564 -278.4396 -277.9638 -277.9502 -277.9494 -277.8702 -277.8337 -277.8133 -277.8103 -277.8023 -277.7928 -277.7899 -277.7565 -277.7553 -277.7357 -277.6808 -277.6695 -257.2627 -194.0625 -194.0521 -194.0411 -181.1536 -181.1095 -181.0589 -129.6495 -129.6354 -129.6060 -129.5896 -129.5556 -129.5524 -129.5373 -129.5103 -129.4601 -96.9614 -61.7885 -61.6324 -61.4854 -27.1925 -25.7668 -24.1686 -24.1501 -23.6742 -22.5110 -22.4822 -22.4599 -21.7977 -21.7813 -21.6989 -21.6907 -21.6693 -21.2265 -21.0160 -20.9582 -20.9342 -20.9145 -19.3524 -19.3414 -19.0555 -18.9946 -18.9861 -18.9177 -18.8588 -18.8420 -18.7207 -18.5326 -18.2795 -18.2351 -18.1503 -17.1574 -17.1483 -17.1099 -16.4237 -16.4059 -16.2257 -16.1266 -16.1084 -15.7569 -15.1663 -15.1300 -14.8312 -14.6696 -14.6188 -14.2572 -13.9534 -13.4208 -13.3875 -13.3559 -13.1258 -13.0598 -13.0165 -12.8853 -12.8277 -12.7190 -12.6538 -12.6278 -12.6115 -12.5965 -12.5694 -12.4234 -12.3466 -12.2926 -12.2408 -12.1942 -12.1672 -11.9361 -11.8800 -11.8544 -11.8116 -11.7731 -11.7328 -11.5651 -11.5059 -11.4687 -11.4126 -11.1872 -11.1748 -11.1371 -10.8955 -10.8861 -10.8370 -10.8066 -10.7672 -10.7341 -10.6954 -10.6838 -10.6557 -10.6143 -10.5985 -10.4693 -10.4171 -10.3452 -10.2382 -10.1511 -10.0984 -10.0199 -10.0052 -9.9274 -9.7928 -9.7524 -9.7287 -9.6764 -9.6241 -9.5573 -9.5527 -9.5267 -9.5027 -9.3663 -9.3488 -9.1259 -8.9061 -8.8976 -8.7407 -8.4982 -8.4503 -8.4041 -8.2281 -8.2098 -8.1486 -7.5277 -7.4441 -7.4313 -7.2430 -7.2272 -6.3000 -6.2523 -6.2377 -6.1236 -6.0981 -6.0919 -5.7495 -5.6593 -5.5264 -0.9030 -0.8927 -0.8400 -0.3286 -0.2908 0.2610 0.5163 0.5971 1.0030 1.4465 1.5240 electronvolt
energy: -7034.5469 -2773.3063 -2107.0972 -2107.0550 -2106.9979 -830.0929 -705.9026 -705.8930 -705.8750 -392.6682 -392.2781 -280.1299 -279.6988 -279.6860 -279.6818 -278.8245 -278.7772 -278.7748 -278.7737 -278.7648 -278.7562 -278.7301 -278.6593 -278.5661 -278.5627 -278.5313 -278.5170 -278.5128 -278.5125 -278.4963 -278.4929 -278.4904 -278.4755 -278.4743 -278.4568 -278.4564 -278.4392 -277.9638 -277.9501 -277.9493 -277.8696 -277.8335 -277.8130 -277.8091 -277.8021 -277.7914 -277.7880 -277.7558 -277.7548 -277.7356 -277.6808 -277.6681 -257.2627 -194.0624 -194.0520 -194.0411 -181.1559 -181.1112 -181.0609 -129.6511 -129.6375 -129.6069 -129.5911 -129.5592 -129.5569 -129.5391 -129.5162 -129.4667 -93.0602 -57.4702 -57.4473 -57.3884 -27.1719 -25.7434 -24.1676 -24.1489 -23.6712 -22.5072 -22.4793 -22.4565 -21.7959 -21.7797 -21.6973 -21.6892 -21.6677 -21.2203 -21.0147 -20.9573 -20.9330 -20.9123 -19.3506 -19.3396 -19.0534 -18.9927 -18.9844 -18.9160 -18.8584 -18.8403 -18.7193 -18.5279 -18.2749 -18.2299 -18.1445 -17.1564 -17.1471 -17.1051 -16.4213 -16.4038 -16.2237 -16.1240 -16.1061 -15.7541 -15.1628 -15.1261 -14.8117 -14.6622 -14.6102 -14.1825 -13.9398 -13.4190 -13.3859 -13.3531 -13.1172 -13.0509 -13.0079 -12.8788 -12.8183 -12.6409 -12.6332 -12.6184 -12.6009 -12.5921 -12.4812 -12.4039 -12.3312 -12.2857 -12.2317 -12.1911 -12.1512 -11.9335 -11.8719 -11.8531 -11.8096 -11.7718 -11.7299 -11.5510 -11.4963 -11.4572 -11.4031 -11.1807 -11.1640 -11.1315 -10.8929 -10.8845 -10.8332 -10.8043 -10.7569 -10.7312 -10.6841 -10.6766 -10.6493 -10.6070 -10.5904 -10.4646 -10.4128 -10.3402 -10.2327 -10.1170 -10.0552 -10.0167 -9.9890 -9.9216 -9.7899 -9.7490 -9.7220 -9.6727 -9.6181 -9.5497 -9.5409 -9.5219 -9.4906 -9.3554 -9.3396 -9.0718 -8.8939 -8.8814 -8.6539 -8.3812 -8.3420 -8.2839 -7.9192 -7.5935 -7.5348 -7.4104 -7.3811 -7.3386 -6.9102 -6.8934 -6.1358 -6.0984 -6.0906 -5.9483 -4.4425 -4.4286 -0.9772 -0.9528 -0.9161 -0.4232 -0.3999 -0.1586 -0.1017 0.1762 0.4453 1.2750 1.3507 electronvolt
chargesum: -0.0000000
charge: 0.090339 0.446225 0.449492 0.461890 -0.373502 0.105006 -0.182191 0.187716 -0.217482 0.173762 0.057352 -0.294965 0.177314 -0.108894 -0.484376 0.190246 0.190433 0.198632 0.079234 -0.178254 0.188281 -0.222883 0.174771 0.054381 -0.298219 0.179962 -0.076019 -0.483163 0.189257 0.191590 0.199794 0.065586 -0.176461 0.187188 -0.219301 0.175720 0.060939 -0.297616 0.177776 -0.080146 -0.484760 0.190521 0.192005 0.199115 -0.423148 0.214625 -0.525912 0.210766 0.209327 0.185824 -0.471986 0.177230 0.178752 0.166073 -0.440447 0.250943 -0.468496 0.181026 0.194376 0.178866 -0.481148 0.182073 0.169738 0.189308 -0.429990 0.214866 -0.514408 0.180026 0.206163 0.177339 -0.483517 0.182637 0.192846 0.190818 -0.436634 0.251821 -0.469767 0.184287 0.186254 0.180655 -0.493116 0.181584 0.214530 0.182753 -0.473569 0.226381 -0.480692 0.183256 0.204964 0.189517 -0.484986 0.183285 0.212313 0.179976 -0.455174 0.251999 -0.456677 0.179923 0.191785 0.176010 -0.490496 0.185508 0.201970 0.188547 -0.025011 -0.115972 -0.510406 0.241913 0.194776 0.240949 -0.773320
charge: -1.280173 0.831952 0.847965 0.836095 0.001026 0.003781 -0.154822 0.162030 -0.137877 0.157727 -0.058670 -0.141347 0.154036 -0.163649 -0.385874 0.154427 0.152278 0.159558 0.002079 -0.154042 0.162424 -0.139861 0.158145 -0.057313 -0.142360 0.154618 -0.163580 -0.385783 0.152938 0.154079 0.160286 -0.000752 -0.155840 0.163355 -0.138982 0.158669 -0.056117 -0.144912 0.154875 -0.163539 -0.385607 0.152215 0.155498 0.160029 -0.288252 0.146881 -0.394821 0.149970 0.141132 0.146034 -0.402530 0.143564 0.140748 0.131664 -0.288388 0.155468 -0.397583 0.140349 0.140482 0.143725 -0.399566 0.145165 0.129344 0.140549 -0.289827 0.145712 -0.401589 0.134137 0.140506 0.142317 -0.395270 0.146155 0.141435 0.146148 -0.291147 0.158968 -0.398742 0.141434 0.141598 0.145081 -0.395501 0.145119 0.143898 0.140653 -0.293472 0.152682 -0.399443 0.147920 0.140424 0.142080 -0.392240 0.142547 0.150283 0.143810 -0.287676 0.156129 -0.398135 0.140511 0.140815 0.143909 -0.397119 0.146939 0.143545 0.140025 0.094944 0.130193 -0.425856 0.192375 0.161365 0.191867 -0.812428
qa: 0.0903 0.4462 0.4495 0.4619 -0.3735 0.1050 -0.1822 0.1877 -0.2175 0.1738 0.0574 -0.2950 0.1773 -0.1089 -0.4844 0.1902 0.1904 0.1986 0.0792 -0.1783 0.1883 -0.2229 0.1748 0.0544 -0.2982 0.1800 -0.0760 -0.4832 0.1893 0.1916 0.1998 0.0656 -0.1765 0.1872 -0.2193 0.1757 0.0609 -0.2976 0.1778 -0.0801 -0.4848 0.1905 0.1920 0.1991 -0.4231 0.2146 -0.5259 0.2108 0.2093 0.1858 -0.4720 0.1772 0.1788 0.1661 -0.4404 0.2509 -0.4685 0.1810 0.1944 0.1789 -0.4811 0.1821 0.1697 0.1893 -0.4300 0.2149 -0.5144 0.1800 0.2062 0.1773 -0.4835 0.1826 0.1928 0.1908 -0.4366 0.2518 -0.4698 0.1843 0.1863 0.1807 -0.4931 0.1816 0.2145 0.1828 -0.4736 0.2264 -0.4807 0.1833 0.2050 0.1895 -0.4850 0.1833 0.2123 0.1800 -0.4552 0.2520 -0.4567 0.1799 0.1918 0.1760 -0.4905 0.1855 0.2020 0.1885 -0.0250 -0.1160 -0.5104 0.2419 0.1948 0.2409 -0.7733
va: 5.3042 3.6786 3.7207 3.6604 3.0909 3.9974 3.8009 0.9377 3.8218 0.9408 3.9013 3.8891 0.9467 3.8337 3.8172 0.9286 0.9320 0.9218 4.0050 3.7928 0.9376 3.8289 0.9411 3.9037 3.8840 0.9448 3.8293 3.8184 0.9312 0.9294 0.9215 4.0152 3.7929 0.9376 3.8174 0.9399 3.9050 3.8845 0.9491 3.8274 3.8182 0.9326 0.9276 0.9218 3.9170 0.9062 3.7872 0.9317 0.9261 0.9295 3.7763 0.9340 0.9463 1.0037 3.9134 0.8722 3.8025 0.9339 0.9298 0.9319 3.7883 0.9286 0.9883 0.9287 3.9263 0.9064 3.7551 1.0053 0.9251 0.9378 3.7983 0.9330 0.9333 0.9420 3.9051 0.8694 3.8095 0.9326 0.9356 0.9300 3.7981 0.9302 0.9286 0.9381 3.9219 0.9011 3.7928 0.9296 0.9247 0.9378 3.8097 0.9347 0.9298 0.9310 3.9225 0.8714 3.7971 0.9393 0.9322 0.9336 3.7922 0.9287 0.9330 0.9366 3.9828 3.2746 3.7535 0.9138 1.0559 0.9140 0.4398
dispersion: -0.192801852 hartree
energy: -4467.092661975943 hartree
dipole: 14.554036861 -9.526132591 5.027904270 5.703766595 -2.745949997 2.957816598 -6.712508679 -0.009122711 -6.721631390
dipolemethod: SCF
magnitude: 8.899934208 au
magnitude: 22.621834971 debye
temp: 298.15 k
press: 1.00 atm
zeropoint: 0.96028451 hartree
thermalvibcorrection: 0.05615986 hartree
thermalrotcorrection: 0.00141627 hartree
thermaltrasncorrection: 0.00141627 hartree
thermaltotal: -4466.07338506 hartree
thermalcorr: 0.05899241 hartree
nonthermalcorr: 0.96028451 hartree
totalcorr: 1.01927692 hartree
thermalcorrenthalpy: 0.00094421 hartree
totalenthalpy: -4466.07244085 hartree
vibrat: 0.10145234 hartree
rotat: 0.01834909 hartree
transl: 0.02175884 hartree
total: 0.14286918 hartree
totalentropycorr: -0.14286918 hartree
gibbsenthalpy: -4466.21531003 hartree
gibbsminuselec: 0.87735194 hartree
