program: Orca
programVersion: 6.1.x
elementType: Fe P P P Cl N C C H C H C C H C C H H H C C H C H C C H C C H H H C C H C H C C H C C H H H C H C H H H C H H H C H C H H H C H H H C H C H H H C H H H C H C H H H C H H H C H C H H H C H H H C H C H H H C H H H C N C H H H
charge: 0
multiplicity: 4
keywords: DLPNO-CCSD(T) DKH2 DKH-def2-TZVP def2-tzvp/c CPCM(acetonitrile) RIJCOSX
formula: C41H63ClFeN2P3
InChI: InChI=1/C39H60NP3.C2H3N.ClH.Fe/c1-25(2)41(26(3)4)37-22-31(13)16-19-34(37)40(35-20-17-32(14)23-38(35)42(27(5)6)28(7)8)36-21-18-33(15)24-39(36)43(29(9)10)30(11)12;1-2-3;;/h16-30H,1-15H3;1H3;1H;/q;;;+1/p-1/rC39H60ClFeNP3.C2H3N/c1-25(2)43(26(3)4)37-22-31(13)16-19-34(37)42-35-20-17-32(14)23-38(35)44(27(5)6,28(7)8)41(43,40)45(29(9)10,30(11)12)39-24-33(15)18-21-36(39)42;1-2-3/h16-30H,1-15H3;1H3
111 atoms
Fe -0.0321 -0.078857 0.071243
P  -0.747575 -2.216303 -0.712359
P  -1.625041 1.522919 -0.565122
P  2.036296 0.5396 -0.952476
Cl 0.076477 -0.186488 2.450876
N  -0.324248 -0.054083 -2.819137
C  0.248499 -1.305399 -3.181646
C  0.985522 -1.422827 -4.364262
H  1.117238 -0.546157 -4.996968
C  1.545535 -2.640369 -4.735854
H  2.122783 -2.706842 -5.659203
C  1.357776 -3.78217 -3.948617
C  0.604586 -3.652107 -2.776827
H  0.454658 -4.543057 -2.167703
C  0.066747 -2.43024 -2.355348
C  1.968735 -5.100584 -4.332052
H  1.928848 -5.260685 -5.418066
H  1.456457 -5.937494 -3.840124
H  3.028535 -5.143559 -4.036891
C  -1.739568 0.052762 -2.954173
C  -2.398276 -0.626359 -3.982993
H  -1.820265 -1.245343 -4.667944
C  -3.778622 -0.530402 -4.131054
H  -4.271881 -1.082793 -4.932104
C  -4.534633 0.27422 -3.272228
C  -3.860271 0.954117 -2.250493
H  -4.454741 1.561955 -1.568903
C  -2.478792 0.846945 -2.053608
C  -6.020102 0.419777 -3.446666
H  -6.253995 1.182585 -4.205521
H  -6.505334 0.728333 -2.511601
H  -6.478858 -0.520471 -3.780541
C  0.405793 1.117051 -3.178323
C  -0.048154 1.910273 -4.23815
H  -0.926215 1.592215 -4.79849
C  0.580901 3.107663 -4.55985
H  0.196018 3.714882 -5.380244
C  1.694212 3.539012 -3.831278
C  2.153713 2.721449 -2.793315
H  3.008337 3.076097 -2.224433
C  1.540845 1.51152 -2.442737
C  2.389307 4.829565 -4.161875
H  3.012192 5.173952 -3.326496
H  1.668394 5.621825 -4.405056
H  3.046122 4.710066 -5.037267
C  -0.103997 -3.684777 0.261721
H  -0.387858 -4.606744 -0.268825
C  1.416177 -3.599992 0.37619
H  1.695815 -2.72873 0.983994
H  1.924869 -3.512962 -0.590854
H  1.802742 -4.497995 0.881719
C  -0.686841 -3.729367 1.677027
H  -0.157827 -4.500995 2.257445
H  -1.751118 -3.976172 1.702921
H  -0.543933 -2.766198 2.186871
C  -2.536599 -2.658491 -1.144296
H  -2.902751 -1.71917 -1.579762
C  -2.672696 -3.75531 -2.194597
H  -2.224825 -4.701233 -1.854413
H  -2.203392 -3.481463 -3.1472
H  -3.739412 -3.947418 -2.390087
C  -3.41482 -2.978942 0.063654
H  -4.471408 -2.850724 -0.21575
H  -3.221122 -2.336235 0.929291
H  -3.289554 -4.02293 0.380522
C  -3.023726 1.762783 0.651691
H  -3.819078 2.349542 0.169301
C  -3.575819 0.401235 1.057322
H  -2.788222 -0.201499 1.528813
H  -3.965478 -0.16157 0.19986
H  -4.395177 0.521729 1.782861
C  -2.541177 2.531671 1.881779
H  -3.318884 2.502567 2.660234
H  -2.339033 3.586483 1.662144
H  -1.630793 2.079185 2.300188
C  -1.18762 3.264893 -1.124097
H  -0.661437 3.074749 -2.068543
C  -2.3889 4.151421 -1.429128
H  -2.944688 4.418919 -0.519114
H  -3.087618 3.666705 -2.125101
H  -2.053169 5.09053 -1.895759
C  -0.18878 3.934482 -0.184404
H  0.261446 4.810035 -0.67614
H  0.622467 3.246538 0.085624
H  -0.656718 4.28237 0.744827
C  3.136291 1.741964 -0.006496
H  2.568407 2.681779 -0.082888
C  4.557649 2.007163 -0.507313
H  4.973615 2.864741 0.043623
H  4.623791 2.240217 -1.575498
H  5.21756 1.152553 -0.31609
C  3.173884 1.361399 1.474183
H  3.73586 0.4308 1.636008
H  2.168408 1.214481 1.88807
H  3.679004 2.154922 2.046303
C  3.16866 -0.797914 -1.647443
H  2.441048 -1.551157 -1.976954
C  4.008521 -0.412971 -2.860086
H  4.793657 0.311328 -2.610453
H  3.394655 0.01398 -3.663436
H  4.502472 -1.311415 -3.262238
C  4.013841 -1.439827 -0.5484
H  4.41547 -2.399655 -0.906586
H  3.43252 -1.644225 0.358792
H  4.869148 -0.814201 -0.264885
C  -3.251775 -1.484881 4.232622
N  -3.681783 -2.466228 3.790955
C  -2.696672 -0.255708 4.765612
H  -1.746822 -0.043198 4.251235
H  -2.51743 -0.355968 5.843831
H  -3.390503 0.577023 4.593017
elementType: Fe P Cl N C H
totalener: -4456.33950670902868 hartree
nucrepener: 9430.32904053450147 hartree
cpcmener: -0.04273709489699 hartree
kineticenergy: 4536.58120614883683 hartree
s2: 5.196729
energy: -7169.4084 -2859.7714 -2181.0818 -2181.0151 -2180.9459 -878.0731 -744.1271 -743.9080 -743.8659 -424.1439 -423.9373 -307.2707 -306.9460 -306.9312 -306.9085 -306.4164 -305.8391 -305.8385 -305.8317 -305.8183 -305.8102 -305.7978 -305.7164 -305.7004 -305.6905 -305.6845 -305.6650 -305.6283 -305.6193 -305.5960 -305.5814 -305.5667 -305.5610 -305.5225 -305.5133 -305.4858 -305.4782 -305.4287 -305.4243 -305.4193 -305.2002 -305.1714 -305.1660 -305.1437 -305.1098 -305.1093 -305.1018 -305.1016 -305.1000 -305.0619 -305.0163 -304.9689 -286.2801 -215.5727 -215.5723 -215.5683 -204.4623 -204.3988 -204.3442 -146.1597 -146.1446 -146.1356 -146.0956 -146.0787 -146.0727 -146.0388 -146.0224 -146.0194 -113.5241 -74.4626 -73.8922 -73.7812 -35.1645 -33.3243 -31.5282 -31.5056 -30.8862 -29.3376 -29.3075 -29.2781 -28.5806 -28.5569 -28.4911 -28.4784 -28.4582 -27.7787 -27.6933 -27.6458 -27.6234 -27.3001 -26.8625 -25.6619 -25.6470 -25.2499 -25.1989 -25.1833 -25.0783 -25.0436 -24.8912 -24.4870 -23.8987 -23.8196 -23.7778 -22.4579 -22.4330 -22.4120 -21.5912 -21.5450 -21.4770 -21.3563 -21.3417 -20.8065 -19.6180 -19.5818 -19.3958 -19.1410 -19.0915 -18.5353 -18.2339 -17.4636 -17.4393 -17.3853 -17.1291 -17.0529 -17.0064 -16.8528 -16.7744 -16.5852 -16.5741 -16.5315 -16.5003 -16.4673 -16.4203 -16.1335 -16.0820 -16.0052 -15.9853 -15.9035 -15.7341 -15.6214 -15.5090 -15.4211 -15.4024 -15.3520 -15.3308 -15.2197 -15.1681 -15.1103 -15.0440 -14.9308 -14.8183 -14.7587 -14.5694 -14.5435 -14.5004 -14.4260 -14.3607 -14.3136 -14.2895 -14.2706 -14.2163 -14.2077 -14.1616 -13.8623 -13.8042 -13.6991 -13.6554 -13.4471 -13.4169 -13.3494 -13.2753 -13.1971 -13.1648 -13.0956 -13.0728 -12.9829 -12.9351 -12.8545 -12.8250 -12.8041 -12.7207 -12.6374 -12.5919 -12.5856 -12.5538 -12.4743 -12.2598 -11.9130 -11.8834 -11.6156 -11.4935 -11.3567 -11.2907 -10.9465 -10.9239 -10.8609 -10.1399 -10.1010 -9.7891 -9.7609 -9.7209 -9.5561 -9.5233 -9.0942 -8.2109 -8.0638 -7.6759 2.6597 2.9951 3.0459 3.4497 3.5581 3.6183 3.7454 3.7907 3.9056 3.9553 4.2184 electronvolt
energy: -7169.4027 -2859.7667 -2181.0745 -2181.0068 -2180.9378 -875.6519 -741.5893 -741.5777 -741.5216 -424.1579 -423.9372 -307.2708 -306.6100 -306.5939 -306.5732 -306.4161 -306.0131 -305.9918 -305.9865 -305.9677 -305.9419 -305.9147 -305.8050 -305.7791 -305.7728 -305.7170 -305.6230 -305.6068 -305.5862 -305.5711 -305.5483 -305.5455 -305.5415 -305.5360 -305.5198 -305.5134 -305.4950 -305.3923 -305.3877 -305.3827 -305.1986 -305.1687 -305.1643 -305.1424 -305.1093 -305.1050 -305.1032 -305.1008 -305.0994 -305.0580 -305.0156 -304.9682 -286.2745 -215.5752 -215.5594 -215.5587 -204.4546 -204.3898 -204.3354 -146.1493 -146.1323 -146.1249 -146.0860 -146.0636 -146.0595 -146.0306 -146.0109 -146.0038 -106.2398 -65.4789 -65.3829 -64.9145 -34.7940 -33.3242 -31.5246 -31.5018 -30.9325 -29.3817 -29.3533 -29.3295 -28.6316 -28.6127 -28.5248 -28.5092 -28.4814 -27.7785 -27.7445 -27.6900 -27.6789 -27.6569 -26.8078 -25.2953 -25.2654 -25.2206 -25.1814 -25.1748 -25.0717 -25.0370 -24.8883 -24.4596 -23.7210 -23.6516 -23.6496 -22.5418 -22.5257 -22.4326 -21.7248 -21.6910 -21.5199 -21.4116 -21.3920 -20.7254 -19.5649 -19.5114 -19.4294 -19.0064 -18.9677 -18.5349 -18.1376 -17.5076 -17.4530 -17.4335 -17.1513 -17.0933 -17.0079 -16.9024 -16.8211 -16.6401 -16.6226 -16.5063 -16.4957 -16.4638 -16.3957 -16.1503 -16.0811 -15.9811 -15.8918 -15.8735 -15.7372 -15.6764 -15.6564 -15.6214 -15.5540 -15.4573 -15.4041 -15.2484 -15.1609 -15.1185 -15.0695 -14.8458 -14.7978 -14.7412 -14.5523 -14.5259 -14.4929 -14.4232 -14.3679 -14.3158 -14.2847 -14.2475 -14.2145 -14.1791 -14.1401 -13.7849 -13.7640 -13.7092 -13.6094 -13.4632 -13.4318 -13.3518 -13.2012 -13.1181 -13.0768 -13.0532 -12.9406 -12.8803 -12.8231 -12.7892 -12.7629 -12.7041 -12.6055 -12.5900 -12.5444 -12.2237 -11.9549 -11.9312 -11.6650 -11.3141 -11.2661 -11.1743 -11.0225 -10.6027 -10.4933 -10.3840 -9.9598 -9.8589 -9.5124 -9.4396 -9.3946 -8.9029 -8.8706 -8.3559 -6.7652 -6.6374 2.9080 2.9387 2.9770 3.4387 3.5950 3.6082 3.6787 3.7367 3.9607 4.1587 4.2668 electronvolt
chargesum: -0.0000000
charge: 0.465585 0.052822 0.079786 0.027509 -0.817364 0.119904 0.086534 -0.264512 0.151968 -0.185753 0.156521 0.177397 -0.257493 0.172964 -0.058517 -0.442158 0.138935 0.140039 0.137441 0.071209 -0.272411 0.154271 -0.170847 0.157229 0.167150 -0.256374 0.172502 -0.033621 -0.450202 0.138851 0.140485 0.139328 0.102915 -0.299098 0.154330 -0.135124 0.159112 0.093043 -0.122302 0.168384 -0.134662 -0.452263 0.140298 0.139371 0.139988 -0.026523 0.106763 -0.434372 0.113554 0.145060 0.133764 -0.458561 0.125799 0.136887 0.141642 0.115671 0.056990 -0.434731 0.130020 0.136294 0.129310 -0.482032 0.134489 0.155158 0.137021 -0.017419 0.108545 -0.460777 0.117194 0.150554 0.132880 -0.451253 0.130139 0.136305 0.133604 0.089382 0.064092 -0.431509 0.129561 0.136820 0.129492 -0.412267 0.128437 0.106324 0.132736 -0.032734 0.104756 -0.425686 0.135346 0.139078 0.128200 -0.422812 0.127330 0.140385 0.125612 0.087072 0.051285 -0.413991 0.133299 0.135272 0.124986 -0.443124 0.135036 0.143907 0.134326 0.040369 -0.342480 -0.271342 0.182805 0.193958 0.180935
charge: -0.802945 0.859319 0.859152 0.861270 -0.293453 0.232503 -0.178299 -0.106695 0.155528 -0.105371 0.150377 -0.172363 -0.106320 0.153178 -0.214891 -0.241211 0.123995 0.124090 0.124820 -0.175070 -0.107868 0.156351 -0.106613 0.150549 -0.171918 -0.108408 0.152149 -0.209850 -0.241276 0.124986 0.124189 0.124218 -0.176299 -0.109989 0.157189 -0.109360 0.150583 -0.171204 -0.104017 0.153449 -0.208122 -0.240801 0.124449 0.124409 0.125322 -0.385658 0.136741 -0.289728 0.117966 0.116909 0.117294 -0.297451 0.116362 0.111537 0.109928 -0.389474 0.152282 -0.289057 0.115201 0.116386 0.117296 -0.295128 0.117421 0.112714 0.116431 -0.387168 0.136903 -0.289006 0.118478 0.118244 0.117052 -0.290373 0.117142 0.111069 0.113707 -0.391277 0.156733 -0.288688 0.116404 0.117378 0.116688 -0.290157 0.117251 0.114345 0.113759 -0.393877 0.144123 -0.292598 0.118735 0.110400 0.114463 -0.300233 0.114622 0.108589 0.114733 -0.391942 0.153116 -0.287953 0.115397 0.117090 0.117070 -0.289674 0.118233 0.115311 0.113140 -0.178871 -0.055993 -0.251037 0.136445 0.152541 0.151980
qa: 0.4656 0.0528 0.0798 0.0275 -0.8174 0.1199 0.0865 -0.2645 0.1520 -0.1858 0.1565 0.1774 -0.2575 0.1730 -0.0585 -0.4422 0.1389 0.1400 0.1374 0.0712 -0.2724 0.1543 -0.1708 0.1572 0.1672 -0.2564 0.1725 -0.0336 -0.4502 0.1389 0.1405 0.1393 0.1029 -0.2991 0.1543 -0.1351 0.1591 0.0930 -0.1223 0.1684 -0.1347 -0.4523 0.1403 0.1394 0.1400 -0.0265 0.1068 -0.4344 0.1136 0.1451 0.1338 -0.4586 0.1258 0.1369 0.1416 0.1157 0.0570 -0.4347 0.1300 0.1363 0.1293 -0.4820 0.1345 0.1552 0.1370 -0.0174 0.1085 -0.4608 0.1172 0.1506 0.1329 -0.4513 0.1301 0.1363 0.1336 0.0894 0.0641 -0.4315 0.1296 0.1368 0.1295 -0.4123 0.1284 0.1063 0.1327 -0.0327 0.1048 -0.4257 0.1353 0.1391 0.1282 -0.4228 0.1273 0.1404 0.1256 0.0871 0.0513 -0.4140 0.1333 0.1353 0.1250 -0.4431 0.1350 0.1439 0.1343 0.0404 -0.3425 -0.2713 0.1828 0.1940 0.1809
va: 4.5529 3.5486 3.5357 3.5650 0.3237 2.2669 3.6304 3.7878 0.9792 3.7428 0.9649 3.5891 3.6117 0.9386 3.7483 3.8525 0.9569 0.9613 0.9556 3.6927 3.7892 0.9775 3.7430 0.9641 3.5966 3.5981 0.9374 3.8801 3.8623 0.9542 0.9598 0.9574 3.6524 3.8320 0.9766 3.6985 0.9630 3.6708 3.5132 0.9255 3.8119 3.8620 0.9611 0.9567 0.9543 3.7228 0.9542 3.8865 0.9812 0.9422 0.9653 3.8577 0.9625 0.9570 0.9894 3.6600 0.9596 3.8969 0.9617 0.9572 0.9630 3.8695 0.9632 0.9356 0.9553 3.7314 0.9533 3.8925 0.9738 0.9443 0.9641 3.8529 0.9628 0.9590 0.9910 3.7199 0.9364 3.8718 0.9581 0.9554 0.9635 3.8693 0.9657 0.9691 0.9635 3.6989 0.9539 3.8618 0.9649 0.9541 0.9605 3.8477 0.9625 0.9868 0.9627 3.7335 0.9444 3.8591 0.9587 0.9601 0.9672 3.8722 0.9638 0.9481 0.9557 3.9089 2.9797 3.7408 0.9845 0.9495 0.9552
corrType: DLPNO BASED
energy: -4465.437385906013 hartree
dipole: 4.946866508 -4.488892115 0.457974393 3.275026676 -1.273556123 2.001470553 -4.575209743 -0.097782884 -4.672992627
dipolemethod: SCF
magnitude: 5.104163498 au
magnitude: 12.973752570 debye
