program: Orca
programVersion: 6.1.x
elementType: Fe P P P N C C H C H C C H C C H H H C C H C H C C H C C H H H C C H C H C C H C C H H H C H C H H H C H H H C H C H H H C H H H C H C H H H C H H H C H C H H H C H H H C H C H H H C H H H C H C H H H C H H H C N C H H H Cl
charge: 0
multiplicity: 4
keywords: DLPNO-CCSD(T) DKH2 DKH-def2-TZVP def2-tzvp/c CPCM(acetonitrile) RIJCOSX
formula: C41H63ClFeN2P3
InChI: InChI=1/C39H60NP3.C2H3N.Cl.Fe/c1-25(2)41(26(3)4)37-22-31(13)16-19-34(37)40(35-20-17-32(14)23-38(35)42(27(5)6)28(7)8)36-21-18-33(15)24-39(36)43(29(9)10)30(11)12;1-2-3;;/h16-30H,1-15H3;1H3;;/rC41H63FeN2P3.Cl/c1-17-43-42-45(27(2)3,28(4)5)39-24-33(14)18-21-36(39)44(37-22-19-34(15)25-40(37)46(42,29(6)7)30(8)9)38-23-20-35(16)26-41(38)47(42,31(10)11)32(12)13;/h18-32H,1-16H3;
111 atoms
Fe -0.309134 1.446195 2.775794
P  -1.032302 -0.684054 1.936417
P  -1.870448 3.083014 2.136587
P  1.783346 2.115924 1.82204
N  -0.512335 1.534443 -0.108646
C  0.07063 0.286409 -0.467526
C  0.863919 0.190647 -1.615893
H  1.026826 1.078695 -2.224643
C  1.440369 -1.019072 -1.986428
H  2.060118 -1.065993 -2.882955
C  1.216598 -2.176534 -1.232697
C  0.409583 -2.068618 -0.095473
H  0.236953 -2.971492 0.488785
C  -0.151376 -0.856397 0.324248
C  1.845756 -3.487148 -1.612542
H  1.855106 -3.626517 -2.702051
H  1.312893 -4.333351 -1.160147
H  2.891186 -3.534805 -1.270711
C  -1.92279 1.650997 -0.279604
C  -2.55553 1.000528 -1.341922
H  -1.961875 0.393439 -2.024227
C  -3.928941 1.120594 -1.532713
H  -4.403332 0.596287 -2.363362
C  -4.700858 1.920312 -0.684001
C  -4.050203 2.577921 0.367536
H  -4.655434 3.193051 1.032941
C  -2.678794 2.44266 0.609006
C  -6.187678 2.043208 -0.862119
H  -6.482145 1.873938 -1.906073
H  -6.547874 3.034317 -0.556105
H  -6.718025 1.299561 -0.247276
C  0.233527 2.699931 -0.450488
C  -0.189057 3.506254 -1.513338
H  -1.072594 3.217369 -2.080597
C  0.486333 4.677846 -1.834555
H  0.127643 5.296128 -2.658522
C  1.618421 5.066682 -1.109923
C  2.037521 4.242464 -0.060661
H  2.905702 4.56348 0.50831
C  1.368115 3.065408 0.297891
C  2.370349 6.320697 -1.455286
H  3.020003 6.638192 -0.629815
H  1.685011 7.145489 -1.693012
H  3.008427 6.165429 -2.338774
C  -0.404041 -2.164713 2.897253
H  -0.573922 -3.069606 2.295436
C  1.092493 -1.984996 3.136168
H  1.270051 -1.109872 3.776534
H  1.661928 -1.848224 2.209358
H  1.498485 -2.867055 3.653797
C  -1.112048 -2.345298 4.240969
H  -0.516952 -3.024868 4.869677
H  -2.107517 -2.786691 4.14018
H  -1.229961 -1.403714 4.793032
C  -2.812752 -1.079947 1.457103
H  -3.148731 -0.127236 1.026609
C  -2.932696 -2.156762 0.384313
H  -2.51146 -3.114911 0.724083
H  -2.42776 -1.874517 -0.547594
H  -3.99541 -2.327023 0.151711
C  -3.731665 -1.404683 2.636119
H  -4.772264 -1.201284 2.342546
H  -3.525143 -0.826795 3.544405
H  -3.674168 -2.469215 2.897835
C  -3.304197 3.330695 3.306077
H  -4.052187 3.969918 2.815013
C  -3.933799 1.983782 3.641032
H  -3.242753 1.358345 4.22176
H  -4.238257 1.425437 2.747409
H  -4.827574 2.131979 4.266186
C  -2.843452 4.028934 4.585963
H  -3.639072 3.966938 5.343385
H  -2.623727 5.090951 4.429041
H  -1.94728 3.550238 5.006837
C  -1.348021 4.813843 1.63386
H  -0.724584 4.615001 0.753004
C  -2.499211 5.712434 1.200363
H  -3.159146 5.967406 2.04204
H  -3.109322 5.244415 0.41566
H  -2.103767 6.656745 0.795592
C  -0.454924 5.480878 2.678074
H  0.12697 6.288322 2.209532
H  0.253646 4.771639 3.12525
H  -1.036851 5.926954 3.493786
C  2.780938 3.360076 2.826847
H  2.240626 4.298298 2.631378
C  4.252973 3.592041 2.482408
H  4.615007 4.461622 3.051731
H  4.436848 3.7969 1.4222
H  4.87897 2.738088 2.766583
C  2.63188 3.056932 4.31779
H  3.071141 2.085026 4.582916
H  1.579658 3.043696 4.624676
H  3.150532 3.828717 4.90649
C  2.963591 0.775433 1.234194
H  2.264898 0.014426 0.859645
C  3.886071 1.153393 0.081191
H  4.636226 1.897883 0.375108
H  3.325392 1.552526 -0.773698
H  4.42443 0.257063 -0.264025
C  3.726704 0.157614 2.405248
H  4.141714 -0.815064 2.102361
H  3.085382 -0.014296 3.278271
H  4.566943 0.78495 2.726361
C  -0.238988 1.158503 5.91316
N  -0.229409 1.274241 4.759977
C  -0.312108 0.993138 7.345639
H  0.483508 0.321522 7.694129
H  -1.304459 0.550308 7.558658
H  -0.212425 1.964563 7.847784
Cl -3.389574 -0.362091 6.724042
elementType: Fe P N C H Cl
totalener: -4456.33882696966066 hartree
nucrepener: 9393.68125374581905 hartree
cpcmener: -0.07431567846292 hartree
kineticenergy: 4536.62717565245202 hartree
s2: 5.190099
energy: -7169.5365 -2859.3233 -2181.1313 -2181.0800 -2181.0125 -878.2178 -744.1860 -744.1020 -744.0401 -424.2838 -424.1965 -307.6913 -306.9772 -306.9681 -306.9642 -306.4211 -305.8752 -305.8685 -305.8608 -305.8530 -305.8403 -305.8304 -305.7772 -305.7294 -305.7247 -305.7036 -305.6827 -305.6783 -305.6711 -305.6645 -305.6597 -305.6217 -305.6202 -305.5794 -305.5428 -305.5103 -305.5050 -305.4429 -305.4297 -305.4287 -305.2434 -305.2126 -305.1992 -305.1939 -305.1912 -305.1813 -305.1671 -305.1427 -305.1414 -305.1208 -305.0689 -305.0572 -285.8096 -215.1010 -215.1005 -215.0998 -204.5185 -204.4710 -204.4144 -146.2153 -146.2016 -146.1946 -146.1677 -146.1526 -146.1471 -146.1100 -146.0945 -146.0913 -113.6475 -74.4163 -74.1184 -73.9522 -35.2184 -33.7775 -31.5637 -31.5442 -30.9206 -29.3933 -29.3626 -29.3343 -28.6235 -28.6045 -28.5302 -28.5269 -28.5224 -27.9283 -27.7340 -27.6831 -27.6601 -27.3304 -26.1153 -25.6836 -25.6735 -25.3095 -25.2414 -25.2310 -25.1497 -25.0891 -24.9494 -24.5198 -23.9516 -23.8715 -23.8338 -22.4981 -22.4831 -22.4587 -21.6439 -21.6064 -21.5411 -21.4041 -21.3952 -20.8433 -19.6693 -19.6244 -19.5000 -19.1798 -19.1502 -19.0885 -18.2704 -17.4984 -17.4759 -17.4261 -17.2594 -17.1458 -17.0803 -16.9847 -16.9088 -16.8355 -16.6258 -16.6036 -16.5920 -16.5752 -16.5532 -16.4735 -16.1794 -16.1393 -16.0600 -16.0190 -15.9788 -15.7619 -15.6625 -15.5641 -15.4160 -15.3970 -15.3622 -15.2616 -15.1899 -15.1808 -15.0676 -14.9628 -14.8640 -14.8239 -14.5951 -14.5766 -14.5138 -14.4604 -14.4216 -14.3572 -14.3426 -14.3368 -14.2877 -14.2377 -14.2136 -13.9066 -13.8382 -13.7381 -13.7009 -13.5760 -13.5065 -13.4335 -13.4160 -13.3599 -13.2151 -13.1452 -13.1046 -13.0458 -12.9308 -12.9070 -12.8847 -12.8375 -12.8134 -12.6930 -12.6826 -12.4981 -12.4896 -12.3787 -12.2621 -11.9336 -11.9103 -11.6592 -11.3250 -11.2592 -11.0079 -10.6584 -10.5950 -10.0594 -10.0290 -9.9923 -9.9665 -9.8129 -9.7799 -9.6112 -9.5788 -9.4167 -8.4135 -8.1796 -7.7040 2.5945 2.9577 3.0042 3.3796 3.5505 3.5580 3.6914 3.7105 3.7596 3.8876 4.2256 electronvolt
energy: -7169.5291 -2859.3233 -2181.1257 -2181.0733 -2181.0061 -875.8265 -741.7635 -741.7451 -741.6921 -424.3164 -424.2075 -307.6593 -306.6432 -306.6334 -306.6259 -306.4232 -306.0379 -306.0246 -306.0064 -305.9915 -305.9852 -305.9807 -305.8329 -305.8051 -305.7992 -305.7777 -305.6826 -305.6742 -305.6448 -305.6234 -305.6031 -305.5830 -305.5681 -305.5665 -305.5573 -305.5418 -305.5285 -305.4067 -305.3930 -305.3921 -305.2428 -305.2115 -305.1988 -305.1925 -305.1892 -305.1803 -305.1627 -305.1439 -305.1420 -305.1201 -305.0685 -305.0533 -285.8096 -215.1010 -215.1005 -215.0998 -204.5130 -204.4639 -204.4078 -146.2096 -146.1907 -146.1846 -146.1616 -146.1393 -146.1342 -146.1057 -146.0841 -146.0771 -106.4488 -65.6446 -65.5031 -65.2894 -34.8450 -33.7750 -31.5592 -31.5384 -30.9655 -29.4359 -29.4078 -29.3839 -28.6673 -28.6503 -28.5733 -28.5674 -28.5394 -27.9267 -27.7837 -27.7227 -27.7157 -27.6946 -26.1150 -25.3389 -25.2978 -25.2575 -25.2340 -25.2057 -25.1441 -25.0826 -24.9484 -24.4883 -23.7756 -23.7107 -23.6943 -22.5833 -22.5739 -22.4787 -21.7648 -21.7425 -21.5816 -21.4643 -21.4545 -20.7612 -19.6173 -19.5610 -19.5157 -19.0451 -19.0220 -18.9275 -18.1693 -17.5474 -17.4860 -17.4754 -17.2041 -17.1319 -17.0752 -16.9545 -16.8810 -16.8001 -16.6641 -16.6509 -16.5791 -16.5363 -16.5333 -16.4286 -16.1991 -16.1506 -16.0320 -15.9418 -15.9195 -15.7629 -15.6864 -15.6643 -15.6321 -15.6010 -15.5222 -15.2765 -15.2231 -15.1674 -15.0937 -14.8769 -14.8434 -14.8050 -14.5760 -14.5568 -14.5093 -14.4585 -14.4104 -14.3558 -14.3380 -14.3250 -14.2783 -14.2046 -14.1836 -13.8399 -13.7925 -13.7473 -13.6560 -13.5043 -13.4750 -13.4191 -13.3365 -13.2737 -13.1967 -13.1276 -13.0940 -13.0107 -12.9026 -12.8571 -12.8457 -12.8033 -12.7523 -12.6322 -12.6029 -12.2635 -12.0073 -11.9982 -11.5645 -11.3136 -11.2565 -11.1967 -10.5789 -10.0802 -10.0455 -10.0125 -9.9885 -9.9674 -9.6096 -9.4698 -9.4301 -8.9682 -8.9337 -8.3848 -7.0829 -6.8753 2.8624 2.8868 2.9367 3.3511 3.5194 3.5655 3.6488 3.6784 3.7143 3.9687 4.0400 electronvolt
chargesum: -0.0000000
charge: 0.528679 0.039783 0.089394 0.036927 0.118503 0.102445 -0.265655 0.152266 -0.189213 0.157197 0.179319 -0.243263 0.167988 -0.089377 -0.442586 0.139339 0.140681 0.137706 0.059160 -0.263610 0.155081 -0.178212 0.156720 0.170285 -0.254839 0.172597 -0.044528 -0.445053 0.139710 0.141318 0.139465 0.090398 -0.296000 0.155006 -0.139047 0.160251 0.108234 -0.143083 0.165251 -0.134794 -0.452875 0.140569 0.139752 0.140231 -0.007936 0.105117 -0.434110 0.117009 0.142879 0.135282 -0.459002 0.130344 0.130325 0.144671 0.091022 0.064010 -0.434030 0.131379 0.136702 0.130597 -0.468224 0.136008 0.149670 0.138145 -0.036268 0.110927 -0.452203 0.140241 0.142904 0.127099 -0.437360 0.134486 0.133675 0.125632 0.089134 0.067154 -0.439977 0.131955 0.137488 0.130860 -0.428081 0.133068 0.117717 0.134504 -0.043008 0.107791 -0.420755 0.136395 0.138729 0.128421 -0.419749 0.131773 0.130577 0.132535 0.077492 0.056831 -0.416156 0.133079 0.136207 0.127066 -0.438559 0.136985 0.141757 0.134909 0.251347 -0.421580 -0.364985 0.187597 0.197769 0.187967 -0.935369
charge: -0.603398 0.864993 0.862992 0.867541 0.234095 -0.174934 -0.106150 0.156489 -0.104700 0.150704 -0.172136 -0.104935 0.152766 -0.213970 -0.240953 0.124210 0.124217 0.124995 -0.175616 -0.107211 0.156520 -0.106891 0.150675 -0.171162 -0.105166 0.153354 -0.210281 -0.240849 0.124127 0.124528 0.125404 -0.177470 -0.108362 0.157685 -0.106509 0.151104 -0.170330 -0.103570 0.153444 -0.211418 -0.240388 0.124458 0.124637 0.125503 -0.385105 0.138222 -0.287608 0.120509 0.117779 0.117809 -0.293160 0.118525 0.113374 0.112237 -0.390693 0.152806 -0.288428 0.116001 0.116385 0.117831 -0.293972 0.117662 0.110130 0.116231 -0.389165 0.137804 -0.294740 0.113760 0.117746 0.116027 -0.283707 0.119492 0.112745 0.118918 -0.391183 0.157425 -0.288194 0.116846 0.117705 0.117379 -0.288575 0.117800 0.116322 0.114610 -0.391949 0.146429 -0.290996 0.119282 0.110560 0.114667 -0.288316 0.116563 0.118878 0.117118 -0.393098 0.152425 -0.287221 0.115614 0.117088 0.117597 -0.288693 0.118812 0.115918 0.113867 -0.097222 0.126279 -0.246473 0.154593 0.137914 0.154356 -0.867586
qa: 0.5287 0.0398 0.0894 0.0369 0.1185 0.1024 -0.2657 0.1523 -0.1892 0.1572 0.1793 -0.2433 0.1680 -0.0894 -0.4426 0.1393 0.1407 0.1377 0.0592 -0.2636 0.1551 -0.1782 0.1567 0.1703 -0.2548 0.1726 -0.0445 -0.4451 0.1397 0.1413 0.1395 0.0904 -0.2960 0.1550 -0.1390 0.1603 0.1082 -0.1431 0.1653 -0.1348 -0.4529 0.1406 0.1398 0.1402 -0.0079 0.1051 -0.4341 0.1170 0.1429 0.1353 -0.4590 0.1303 0.1303 0.1447 0.0910 0.0640 -0.4340 0.1314 0.1367 0.1306 -0.4682 0.1360 0.1497 0.1381 -0.0363 0.1109 -0.4522 0.1402 0.1429 0.1271 -0.4374 0.1345 0.1337 0.1256 0.0891 0.0672 -0.4400 0.1320 0.1375 0.1309 -0.4281 0.1331 0.1177 0.1345 -0.0430 0.1078 -0.4208 0.1364 0.1387 0.1284 -0.4197 0.1318 0.1306 0.1325 0.0775 0.0568 -0.4162 0.1331 0.1362 0.1271 -0.4386 0.1370 0.1418 0.1349 0.2513 -0.4216 -0.3650 0.1876 0.1978 0.1880 -0.9354
va: 4.4352 3.5722 3.5677 3.5753 2.2723 3.6289 3.7995 0.9786 3.7407 0.9648 3.5898 3.6141 0.9390 3.7659 3.8512 0.9569 0.9612 0.9556 3.6963 3.7892 0.9772 3.7508 0.9651 3.5951 3.5848 0.9387 3.9022 3.8546 0.9589 0.9584 0.9551 3.6570 3.8397 0.9751 3.7040 0.9629 3.6589 3.5563 0.9287 3.8368 3.8608 0.9612 0.9565 0.9542 3.7236 0.9544 3.9052 0.9682 0.9435 0.9656 3.8767 0.9608 0.9668 0.9641 3.6538 0.9567 3.8971 0.9616 0.9580 0.9626 3.8623 0.9620 0.9605 0.9551 3.7356 0.9522 3.9085 0.9596 0.9442 0.9724 3.8742 0.9634 0.9618 0.9701 3.7114 0.9412 3.8768 0.9582 0.9550 0.9629 3.8713 0.9639 0.9639 0.9620 3.7095 0.9580 3.8721 0.9645 0.9540 0.9590 3.8603 0.9615 0.9683 0.9625 3.7338 0.9484 3.8646 0.9592 0.9604 0.9662 3.8676 0.9635 0.9509 0.9564 3.5984 3.0308 3.7311 0.9505 0.9968 0.9493 0.1099
corrType: DLPNO BASED
energy: -4465.433822961559 hartree
dipole: 14.554036861 -9.197954615 5.356082246 5.703766595 -2.621764330 3.082002265 -6.712508679 0.132401413 -6.580107266
dipolemethod: SCF
magnitude: 9.026858070 au
magnitude: 22.944449790 debye
