program: Orca
programVersion: 5.0
elementType: Fe P P P Cl N C C H C H C C H C C H H H C C H C H C C H C C H H H C C H C H C C H C C H H H C H C H H H C H H H C H C H H H C H H H C H C H H H C H H H C H C H H H C H H H C H C H H H C H H H C H C H H H C H H H C N C H H H
keywords: PBE0 D4 DKH2 DKH-def2-SV(P) def2-tzvp/c Opt Freq UNO UCO NormalPrint CPCM(acetonitrile)
charge: -1
multiplicity: 3
frequency: 0.00 0.00 0.00 0.00 0.00 0.00 20.33 25.32 27.81 31.20 33.43 35.38 39.72 42.14 45.66 53.64 56.11 57.77 64.68 67.84 72.36 75.61 79.16 84.43 89.81 91.22 92.61 98.09 100.67 105.44 109.84 114.88 118.15 119.97 123.64 125.98 130.87 137.65 138.54 146.80 150.93 155.51 157.56 159.53 175.73 181.07 185.07 188.94 197.75 203.46 206.29 213.78 216.79 221.51 226.62 226.92 237.09 239.32 241.67 245.38 248.32 250.71 253.10 258.08 260.62 265.49 267.17 271.90 274.81 282.57 287.36 301.35 309.50 322.62 326.91 336.73 339.28 346.97 351.56 357.04 365.70 369.34 380.93 384.63 396.98 399.12 407.83 408.92 414.63 416.24 425.67 443.52 447.82 466.51 471.37 477.65 483.62 486.74 492.57 509.56 515.12 532.43 542.74 553.33 569.71 586.47 590.53 598.88 608.48 619.99 627.10 641.03 663.13 671.14 673.77 676.87 692.71 697.81 711.43 752.31 761.15 794.60 813.74 827.64 850.12 861.90 873.29 887.15 898.89 906.01 909.44 918.41 919.76 923.69 925.14 926.32 926.51 929.69 933.73 936.71 939.77 941.44 945.55 949.51 950.51 962.99 964.66 977.62 979.84 980.83 981.81 989.13 990.28 1004.94 1017.38 1018.08 1041.49 1042.72 1043.20 1053.54 1061.99 1062.22 1064.03 1065.09 1067.44 1068.38 1072.67 1083.19 1092.77 1095.59 1100.97 1132.67 1139.51 1144.06 1145.28 1148.14 1151.37 1155.64 1157.12 1188.73 1189.67 1190.23 1192.44 1194.34 1195.21 1204.14 1234.71 1248.75 1249.27 1258.50 1273.13 1274.30 1277.22 1284.04 1287.30 1292.43 1296.56 1300.08 1315.46 1324.66 1337.07 1337.97 1338.87 1340.19 1347.34 1348.25 1351.72 1384.56 1390.69 1396.16 1397.20 1399.41 1399.74 1400.78 1402.12 1402.89 1404.95 1407.04 1409.27 1409.80 1411.95 1412.23 1412.55 1414.47 1417.08 1419.89 1427.87 1434.59 1438.86 1447.40 1459.55 1464.58 1471.25 1473.15 1473.78 1475.79 1476.27 1478.85 1480.34 1481.59 1481.66 1482.43 1483.49 1484.28 1484.87 1485.56 1485.99 1487.06 1487.96 1488.82 1490.01 1490.98 1492.38 1495.90 1498.03 1499.38 1501.54 1504.08 1506.33 1507.92 1516.62 1517.40 1532.93 1551.55 1599.87 1607.12 1629.45 1651.56 1675.99 2403.57 3025.44 3037.29 3039.06 3040.85 3041.72 3044.11 3046.42 3047.52 3048.91 3049.01 3049.34 3050.98 3052.04 3053.70 3054.70 3055.56 3068.23 3072.60 3078.02 3085.53 3093.19 3108.70 3112.84 3120.92 3122.23 3122.59 3123.98 3125.42 3127.46 3130.91 3131.51 3133.16 3134.76 3137.09 3137.89 3138.44 3138.57 3142.35 3144.11 3150.16 3154.84 3156.36 3157.51 3159.30 3160.67 3161.21 3162.87 3166.31 3173.89 3176.95 3178.27 3180.01 3181.73 3190.47 3197.98 3199.63 3204.85 3206.82 3212.18 3213.69 3222.51 3227.26 3234.25
frequency: 20.33 25.32 27.81 31.20 33.43 35.38 39.72 42.14 45.66 53.64 56.11 57.77 64.68 67.84 72.36 75.61 79.16 84.43 89.81 91.22 92.61 98.09 100.67 105.44 109.84 114.88 118.15 119.97 123.64 125.98 130.87 137.65 138.54 146.80 150.93 155.51 157.56 159.53 175.73 181.07 185.07 188.94 197.75 203.46 206.29 213.78 216.79 221.51 226.62 226.92 237.09 239.32 241.67 245.38 248.32 250.71 253.10 258.08 260.62 265.49 267.17 271.90 274.81 282.57 287.36 301.35 309.50 322.62 326.91 336.73 339.28 346.97 351.56 357.04 365.70 369.34 380.93 384.63 396.98 399.12 407.83 408.92 414.63 416.24 425.67 443.52 447.82 466.51 471.37 477.65 483.62 486.74 492.57 509.56 515.12 532.43 542.74 553.33 569.71 586.47 590.53 598.88 608.48 619.99 627.10 641.03 663.13 671.14 673.77 676.87 692.71 697.81 711.43 752.31 761.15 794.60 813.74 827.64 850.12 861.90 873.29 887.15 898.89 906.01 909.44 918.41 919.76 923.69 925.14 926.32 926.51 929.69 933.73 936.71 939.77 941.44 945.55 949.51 950.51 962.99 964.66 977.62 979.84 980.83 981.81 989.13 990.28 1004.94 1017.38 1018.08 1041.49 1042.72 1043.20 1053.54 1061.99 1062.22 1064.03 1065.09 1067.44 1068.38 1072.67 1083.19 1092.77 1095.59 1100.97 1132.67 1139.51 1144.06 1145.28 1148.14 1151.37 1155.64 1157.12 1188.73 1189.67 1190.23 1192.44 1194.34 1195.21 1204.14 1234.71 1248.75 1249.27 1258.50 1273.13 1274.30 1277.22 1284.04 1287.30 1292.43 1296.56 1300.08 1315.46 1324.66 1337.07 1337.97 1338.87 1340.19 1347.34 1348.25 1351.72 1384.56 1390.69 1396.16 1397.20 1399.41 1399.74 1400.78 1402.12 1402.89 1404.95 1407.04 1409.27 1409.80 1411.95 1412.23 1412.55 1414.47 1417.08 1419.89 1427.87 1434.59 1438.86 1447.40 1459.55 1464.58 1471.25 1473.15 1473.78 1475.79 1476.27 1478.85 1480.34 1481.59 1481.66 1482.43 1483.49 1484.28 1484.87 1485.56 1485.99 1487.06 1487.96 1488.82 1490.01 1490.98 1492.38 1495.90 1498.03 1499.38 1501.54 1504.08 1506.33 1507.92 1516.62 1517.40 1532.93 1551.55 1599.87 1607.12 1629.45 1651.56 1675.99 2403.57 3025.44 3037.29 3039.06 3040.85 3041.72 3044.11 3046.42 3047.52 3048.91 3049.01 3049.34 3050.98 3052.04 3053.70 3054.70 3055.56 3068.23 3072.60 3078.02 3085.53 3093.19 3108.70 3112.84 3120.92 3122.23 3122.59 3123.98 3125.42 3127.46 3130.91 3131.51 3133.16 3134.76 3137.09 3137.89 3138.44 3138.57 3142.35 3144.11 3150.16 3154.84 3156.36 3157.51 3159.30 3160.67 3161.21 3162.87 3166.31 3173.89 3176.95 3178.27 3180.01 3181.73 3190.47 3197.98 3199.63 3204.85 3206.82 3212.18 3213.69 3222.51 3227.26 3234.25
formula: C41H63ClFeN2P3
InChI: InChI=1/C39H60NP3.C2H3N.ClH.Fe/c1-25(2)41(26(3)4)37-22-31(13)16-19-34(37)40(35-20-17-32(14)23-38(35)42(27(5)6)28(7)8)36-21-18-33(15)24-39(36)43(29(9)10)30(11)12;1-2-3;;/h16-30H,1-15H3;1H3;1H;/q;;;+1/p-1/rC39H60ClFeNP3.C2H3N/c1-25(2)43(26(3)4)37-22-31(13)16-19-34(37)42-35-20-17-32(14)23-38(35)44(27(5)6,28(7)8)41(40)45(29(9)10,30(11)12)39-24-33(15)18-21-36(39)42;1-2-3/h16-30H,1-15H3;1H3
111 atoms
Fe -0.029692 -0.115194 0.035351
P  -0.767275 -2.226338 -0.760344
P  -1.628136 1.489611 -0.532545
P  2.022663 0.576495 -1.024785
Cl 0.142841 -0.30752 2.432311
N  -0.346498 -0.025551 -2.821587
C  0.250231 -1.261476 -3.18913
C  1.052492 -1.337144 -4.333622
H  1.21625 -0.430789 -4.915072
C  1.611524 -2.547615 -4.733403
H  2.240018 -2.582775 -5.625184
C  1.360503 -3.722778 -4.012631
C  0.562669 -3.630572 -2.868645
H  0.36981 -4.544516 -2.306912
C  0.029839 -2.413925 -2.414028
C  1.956573 -5.035833 -4.439803
H  1.884079 -5.175353 -5.527681
H  1.453564 -5.881132 -3.952134
H  3.024914 -5.092273 -4.179077
C  -1.75732 0.060368 -2.937449
C  -2.413718 -0.614999 -3.970848
H  -1.829357 -1.208193 -4.67269
C  -3.805913 -0.538664 -4.099258
H  -4.303879 -1.088425 -4.899941
C  -4.559172 0.241493 -3.224858
C  -3.881277 0.935612 -2.203964
H  -4.475734 1.537806 -1.517086
C  -2.496596 0.843576 -2.02518
C  -6.055172 0.339388 -3.340136
H  -6.381312 1.38308 -3.463027
H  -6.552208 -0.044953 -2.436431
H  -6.428815 -0.234212 -4.198289
C  0.35866 1.152282 -3.205277
C  -0.156367 1.981142 -4.189869
H  -1.099948 1.706962 -4.662731
C  0.511244 3.168891 -4.575452
H  0.083869 3.824549 -5.335079
C  1.76675 3.467343 -3.981182
C  2.289789 2.614004 -3.024545
H  3.252742 2.877766 -2.592558
C  1.604104 1.43352 -2.560149
C  2.517097 4.702449 -4.401753
H  3.450282 4.822854 -3.83455
H  1.911196 5.610599 -4.251229
H  2.774361 4.676244 -5.473421
C  -0.139577 -3.739629 0.162097
H  -0.452871 -4.638437 -0.391511
C  1.383247 -3.701865 0.263058
H  1.691601 -2.862077 0.899165
H  1.884874 -3.5890 -0.705274
H  1.750335 -4.628649 0.730525
C  -0.705763 -3.811971 1.582953
H  -0.190997 -4.613217 2.136094
H  -1.776078 -4.031442 1.615139
H  -0.53126 -2.866738 2.116457
C  -2.566639 -2.653292 -1.171739
H  -2.922011 -1.712431 -1.61184
C  -2.724236 -3.752217 -2.216388
H  -2.299547 -4.70667 -1.869699
H  -2.24195 -3.490651 -3.165997
H  -3.79387 -3.922572 -2.41825
C  -3.444526 -2.955234 0.041597
H  -4.50058 -2.798375 -0.226556
H  -3.225903 -2.321026 0.907678
H  -3.345866 -4.003264 0.355247
C  -3.029246 1.758457 0.680593
H  -3.8149 2.357035 0.196044
C  -3.60372 0.407769 1.091407
H  -2.82646 -0.203161 1.570041
H  -3.994216 -0.154495 0.23411
H  -4.425528 0.54174 1.812381
C  -2.541173 2.520195 1.912999
H  -3.312792 2.486579 2.697705
H  -2.339433 3.575813 1.698639
H  -1.62719 2.067865 2.32401
C  -1.129216 3.217475 -1.068287
H  -0.531376 2.987898 -1.960411
C  -2.285701 4.11271 -1.493654
H  -2.919288 4.400546 -0.641401
H  -2.923724 3.620774 -2.241198
H  -1.900368 5.040955 -1.944992
C  -0.200179 3.902029 -0.067668
H  0.385678 4.683728 -0.575277
H  0.509064 3.190378 0.376189
H  -0.748411 4.385066 0.751173
C  3.056846 1.859729 -0.09388
H  2.526345 2.790334 -0.348556
C  4.524436 2.05003 -0.481824
H  4.915167 2.954192 0.012353
H  4.686407 2.168547 -1.558507
H  5.144841 1.209149 -0.147336
C  2.954316 1.665903 1.417773
H  3.497091 0.766138 1.742596
H  1.916251 1.547151 1.751872
H  3.400753 2.527227 1.94108
C  3.217537 -0.823272 -1.474734
H  2.505403 -1.589338 -1.815331
C  4.167259 -0.554372 -2.63441
H  4.983197 0.125634 -2.357583
H  3.627359 -0.11411 -3.483718
H  4.624602 -1.496849 -2.97747
C  3.933928 -1.379701 -0.247447
H  4.329164 -2.386405 -0.454493
H  3.261945 -1.461432 0.617369
H  4.783133 -0.75198 0.052768
C  -3.175674 -1.433906 4.260764
N  -3.665012 -2.386567 3.818112
C  -2.5477 -0.240296 4.793108
H  -1.601541 -0.070214 4.2552
H  -2.34802 -0.361244 5.86558
H  -3.203538 0.627365 4.644958
elementType: Fe P Cl N C H
totalener: -4466.93422870 hartree
nucrepener: 9393.22551459 hartree
cpcmener: -0.09277486 hartree
kineticenergy: 4540.42797210 hartree
exchangeener: -298.545584336430 hartree
correlationener: -14.362677966041 hartree
xcener: -312.908262302472 hartree
s2: 3.072313
dispersion: -0.193552078 hartree
s2: 3.069046
dispersion: -0.193513218 hartree
s2: 3.064263
dispersion: -0.192624254 hartree
s2: 3.055626
dispersion: -0.193662452 hartree
s2: 3.050016
dispersion: -0.193431476 hartree
s2: 3.044218
dispersion: -0.193898463 hartree
s2: 3.038788
dispersion: -0.194356129 hartree
s2: 3.038195
dispersion: -0.194340412 hartree
s2: 3.039880
dispersion: -0.194179380 hartree
s2: 3.040426
dispersion: -0.194151451 hartree
s2: 3.041112
dispersion: -0.194208544 hartree
s2: 3.041479
dispersion: -0.194273916 hartree
s2: 3.041270
dispersion: -0.194496774 hartree
s2: 3.041721
dispersion: -0.194241102 hartree
s2: 3.040984
dispersion: -0.194631071 hartree
s2: 3.040786
dispersion: -0.194527344 hartree
s2: 3.041332
dispersion: -0.194380482 hartree
s2: 3.042046
dispersion: -0.194191210 hartree
s2: 3.041509
dispersion: -0.194316587 hartree
s2: 3.041458
dispersion: -0.194490476 hartree
s2: 3.041737
dispersion: -0.194604912 hartree
s2: 3.041647
dispersion: -0.194611528 hartree
s2: 3.041761
dispersion: -0.194760444 hartree
s2: 3.041954
dispersion: -0.195082986 hartree
s2: 3.041764
dispersion: -0.195296597 hartree
s2: 3.041402
dispersion: -0.195163416 hartree
s2: 3.041511
dispersion: -0.195086566 hartree
s2: 3.041419
dispersion: -0.195058419 hartree
s2: 3.041070
dispersion: -0.195282709 hartree
s2: 3.041177
dispersion: -0.195123635 hartree
s2: 3.041150
dispersion: -0.195127571 hartree
s2: 3.040962
dispersion: -0.195075007 hartree
s2: 3.040870
dispersion: -0.195063206 hartree
s2: 3.040840
dispersion: -0.195039900 hartree
s2: 3.040930
dispersion: -0.195035655 hartree
s2: 3.041047
dispersion: -0.195044072 hartree
s2: 3.041073
dispersion: -0.195050554 hartree
s2: 3.041069
dispersion: -0.195064937 hartree
s2: 3.041044
dispersion: -0.195058129 hartree
s2: 3.041011
dispersion: -0.195064214 hartree
s2: 3.040985
dispersion: -0.195062131 hartree
s2: 3.040975
dispersion: -0.195063660 hartree
s2: 3.040946
dispersion: -0.195068378 hartree
dispersion: -0.195071104 hartree
s2: 3.040929
dispersion: -0.195074689 hartree
s2: 3.040940
chargesum: -1.0000000
charge: -0.056420 0.448894 0.448840 0.436786 -0.441008 -0.359817 0.117117 -0.183062 0.168371 -0.238449 0.159635 0.060351 -0.317048 0.164952 -0.111819 -0.486387 0.184187 0.184106 0.191085 0.083262 -0.202814 0.167571 -0.252074 0.159344 0.057580 -0.324352 0.162464 -0.070641 -0.486403 0.186399 0.187104 0.181912 0.067318 -0.222929 0.142463 -0.345815 0.120201 0.079335 -0.369033 0.127532 -0.155122 -0.494181 0.170385 0.168543 0.168800 -0.418084 0.199551 -0.502629 0.185906 0.201879 0.174301 -0.481870 0.168478 0.173266 0.164774 -0.436625 0.248667 -0.465349 0.173135 0.189091 0.169252 -0.495393 0.174830 0.194607 0.185474 -0.419951 0.202853 -0.532544 0.208328 0.201284 0.175873 -0.482824 0.178593 0.186677 0.166838 -0.439856 0.268480 -0.467263 0.174241 0.177696 0.169004 -0.490033 0.170891 0.208252 0.171896 -0.449247 0.204121 -0.478309 0.167878 0.197973 0.176516 -0.474904 0.163804 0.186221 0.160122 -0.435036 0.231736 -0.452100 0.163321 0.177423 0.158207 -0.486656 0.169879 0.190021 0.175229 -0.039487 -0.187571 -0.531503 0.216438 0.241354 0.245714
charge: -1.477620 0.831471 0.847676 0.807967 -0.123523 0.010138 0.012055 -0.163276 0.155171 -0.159812 0.149534 -0.071329 -0.157483 0.147210 -0.172647 -0.387301 0.150830 0.148290 0.154558 0.005966 -0.186694 0.153087 -0.163146 0.149120 -0.073381 -0.172551 0.146176 -0.164360 -0.387507 0.151929 0.152358 0.147269 -0.020756 -0.211531 0.140162 -0.287587 0.128651 -0.086849 -0.221199 0.132304 -0.287192 -0.389248 0.139374 0.140839 0.140745 -0.290582 0.139690 -0.396460 0.142274 0.138682 0.140477 -0.408455 0.138310 0.136585 0.130456 -0.292427 0.155483 -0.397781 0.135641 0.138823 0.138433 -0.398830 0.141048 0.136446 0.137408 -0.290365 0.140037 -0.398846 0.143801 0.139296 0.138552 -0.399123 0.140387 0.138095 0.136056 -0.299145 0.167912 -0.399880 0.136445 0.137898 0.138348 -0.396890 0.138771 0.143763 0.134748 -0.295176 0.144174 -0.399287 0.138899 0.135695 0.135461 -0.402080 0.133791 0.137180 0.132818 -0.301676 0.148737 -0.400381 0.132920 0.137099 0.132953 -0.397458 0.137217 0.137106 0.133510 -0.005349 -0.166802 -0.426243 0.163938 0.190506 0.189477
qa: -0.0564 0.4489 0.4488 0.4368 -0.4410 -0.3598 0.1171 -0.1831 0.1684 -0.2384 0.1596 0.0604 -0.3170 0.1650 -0.1118 -0.4864 0.1842 0.1841 0.1911 0.0833 -0.2028 0.1676 -0.2521 0.1593 0.0576 -0.3244 0.1625 -0.0706 -0.4864 0.1864 0.1871 0.1819 0.0673 -0.2229 0.1425 -0.3458 0.1202 0.0793 -0.3690 0.1275 -0.1551 -0.4942 0.1704 0.1685 0.1688 -0.4181 0.1996 -0.5026 0.1859 0.2019 0.1743 -0.4819 0.1685 0.1733 0.1648 -0.4366 0.2487 -0.4653 0.1731 0.1891 0.1693 -0.4954 0.1748 0.1946 0.1855 -0.4200 0.2029 -0.5325 0.2083 0.2013 0.1759 -0.4828 0.1786 0.1867 0.1668 -0.4399 0.2685 -0.4673 0.1742 0.1777 0.1690 -0.4900 0.1709 0.2083 0.1719 -0.4492 0.2041 -0.4783 0.1679 0.1980 0.1765 -0.4749 0.1638 0.1862 0.1601 -0.4350 0.2317 -0.4521 0.1633 0.1774 0.1582 -0.4867 0.1699 0.1900 0.1752 -0.0395 -0.1876 -0.5315 0.2164 0.2414 0.2457
va: 5.5409 3.6949 3.7304 3.7372 1.0454 3.1007 4.0107 3.8057 0.9501 3.8030 0.9434 3.8876 3.8901 0.9472 3.8164 3.8199 0.9289 0.9341 0.9231 4.0318 3.7793 0.9453 3.8369 0.9448 3.8944 3.8640 0.9476 3.8279 3.8241 0.9258 0.9252 0.9355 3.9744 3.7924 0.9494 3.7451 0.9503 3.8941 3.8812 0.9574 3.7425 3.8301 0.9377 0.9294 0.9288 3.9118 0.9109 3.7850 0.9532 0.9317 0.9315 3.7740 0.9341 0.9491 1.0052 3.9062 0.8750 3.8050 0.9361 0.9350 0.9338 3.8076 0.9300 0.9470 0.9260 3.9230 0.9097 3.7703 0.9552 0.9282 0.9305 3.7860 0.9333 0.9333 0.9821 3.8931 0.8708 3.8126 0.9344 0.9406 0.9343 3.8064 0.9330 0.9325 0.9387 3.9182 0.9131 3.8001 0.9322 0.9254 0.9391 3.7922 0.9422 0.9794 0.9335 3.8885 0.8820 3.8086 0.9417 0.9462 0.9349 3.8020 0.9299 0.9384 0.9371 4.0423 3.0580 3.7770 1.0102 0.9139 0.9171
dispersion: -0.195074920 hartree
energy: -4467.154751430417 hartree
dipole: 4.77095 -5.82361 -1.05266 3.73554 -4.34206 -0.60652 -3.43555 2.60365 -0.83191
magnitude: 1.47242 au
magnitude: 3.74260 debye
temp: 298.15 k
press: 1.00 atm
zeropoint: 0.95376013 hartree
thermalvibcorrection: 0.05779270 hartree
thermalrotcorrection: 0.00141627 hartree
thermaltrasncorrection: 0.00141627 hartree
thermaltotal: -4466.14036606 hartree
thermalcorr: 0.06062524 hartree
nonthermalcorr: 0.95376013 hartree
totalcorr: 1.01438537 hartree
thermalcorrenthalpy: 0.00094421 hartree
totalenthalpy: -4466.13942185 hartree
vibrat: 0.10470356 hartree
rotat: 0.01833648 hartree
transl: 0.02175884 hartree
total: 0.14583617 hartree
totalentropycorr: -0.14583617 hartree
gibbsenthalpy: -4466.28525802 hartree
gibbsminuselec: 0.86949341 hartree
