program: Orca
programVersion: 5.0.4
elementType: Fe P P P N C C H C H C C H C C H H H C C H C H C C H C C H H H C C H C H C C H C C H H H C H C H H H C H H H C H C H H H C H H H C H C H H H C H H H C H C H H H C H H H C H C H H H C H H H C H C H H H C H H H C N C H H H
keywords: PBE0 D4 DKH2 RIJCOSX DKH-def2-SV(P) def2-tzvp/c Opt Freq UNO UCO NormalPrint CPCM(acetonitrile)
charge: 2
multiplicity: 5
frequency: 0.00 0.00 0.00 0.00 0.00 0.00 -35.44 -14.12 20.39 27.92 28.71 33.84 36.29 39.56 41.98 49.13 51.85 59.62 62.20 72.94 74.38 78.43 82.04 89.02 93.41 94.51 97.20 104.47 107.25 109.82 111.34 117.37 119.47 126.75 138.40 143.26 146.53 147.97 151.74 152.93 162.49 171.22 177.58 183.70 195.19 200.46 206.43 210.39 212.27 222.40 229.88 230.86 232.44 235.92 243.73 247.46 248.08 252.72 253.89 255.92 260.27 261.79 265.77 268.37 273.60 275.32 280.66 294.69 299.27 310.34 322.40 326.74 336.30 345.28 351.20 357.82 367.02 371.48 381.83 385.59 389.98 400.86 407.57 414.45 425.97 429.67 434.28 445.46 450.85 469.93 474.56 476.78 485.23 491.12 496.10 503.72 510.68 526.02 544.16 551.24 560.10 587.70 589.29 593.51 614.21 624.42 632.47 670.03 682.75 688.02 691.40 700.94 701.55 706.68 770.97 771.86 774.60 838.51 843.12 856.60 883.25 886.58 909.58 911.37 917.89 920.54 922.37 923.46 923.74 924.38 928.47 928.77 942.29 942.51 947.39 949.27 949.60 951.00 953.41 957.26 982.92 983.76 984.91 986.12 988.43 990.59 993.06 995.81 999.44 1000.69 1024.14 1025.31 1027.03 1047.69 1049.55 1050.91 1051.46 1052.30 1065.70 1065.94 1066.84 1071.56 1075.82 1083.62 1089.08 1105.04 1106.35 1139.15 1147.05 1149.57 1150.18 1152.84 1153.20 1178.28 1178.98 1179.61 1192.24 1193.23 1193.57 1195.37 1196.02 1196.65 1225.71 1257.83 1260.06 1266.03 1282.87 1284.96 1286.21 1291.63 1295.14 1297.09 1297.91 1310.02 1314.55 1319.75 1321.45 1334.35 1337.51 1339.79 1344.42 1348.50 1350.50 1376.59 1389.92 1390.69 1393.72 1405.91 1406.79 1407.73 1409.19 1409.66 1410.48 1413.57 1414.47 1415.21 1417.92 1419.98 1421.07 1423.96 1426.71 1429.92 1430.76 1430.99 1441.23 1441.77 1443.49 1471.14 1471.67 1475.19 1475.74 1477.08 1477.55 1478.28 1481.08 1481.74 1482.68 1484.07 1484.32 1485.70 1486.70 1487.59 1488.50 1489.22 1490.12 1490.50 1490.95 1493.25 1494.24 1496.70 1497.43 1499.92 1500.36 1504.60 1509.14 1510.95 1518.13 1539.04 1541.31 1548.99 1646.27 1652.01 1654.09 1687.69 1687.95 1691.03 2424.69 3056.56 3056.95 3058.65 3060.22 3060.47 3061.20 3063.10 3065.27 3066.02 3066.69 3069.70 3072.27 3074.00 3076.18 3076.62 3077.14 3089.27 3092.17 3095.77 3109.12 3122.90 3133.24 3141.29 3141.36 3141.66 3142.30 3144.98 3145.63 3145.74 3147.92 3151.12 3152.55 3155.54 3158.31 3158.52 3159.04 3161.61 3163.02 3168.84 3169.13 3169.26 3170.36 3172.16 3176.51 3177.81 3178.46 3180.02 3180.56 3181.67 3185.03 3185.37 3187.52 3190.44 3215.54 3218.29 3218.66 3218.84 3222.87 3225.45 3239.23 3239.46 3240.28 3259.15
frequency: 20.39 27.92 28.71 33.84 36.29 39.56 41.98 49.13 51.85 59.62 62.20 72.94 74.38 78.43 82.04 89.02 93.41 94.51 97.20 104.47 107.25 109.82 111.34 117.37 119.47 126.75 138.40 143.26 146.53 147.97 151.74 152.93 162.49 171.22 177.58 183.70 195.19 200.46 206.43 210.39 212.27 222.40 229.88 230.86 232.44 235.92 243.73 247.46 248.08 252.72 253.89 255.92 260.27 261.79 265.77 268.37 273.60 275.32 280.66 294.69 299.27 310.34 322.40 326.74 336.30 345.28 351.20 357.82 367.02 371.48 381.83 385.59 389.98 400.86 407.57 414.45 425.97 429.67 434.28 445.46 450.85 469.93 474.56 476.78 485.23 491.12 496.10 503.72 510.68 526.02 544.16 551.24 560.10 587.70 589.29 593.51 614.21 624.42 632.47 670.03 682.75 688.02 691.40 700.94 701.55 706.68 770.97 771.86 774.60 838.51 843.12 856.60 883.25 886.58 909.58 911.37 917.89 920.54 922.37 923.46 923.74 924.38 928.47 928.77 942.29 942.51 947.39 949.27 949.60 951.00 953.41 957.26 982.92 983.76 984.91 986.12 988.43 990.59 993.06 995.81 999.44 1000.69 1024.14 1025.31 1027.03 1047.69 1049.55 1050.91 1051.46 1052.30 1065.70 1065.94 1066.84 1071.56 1075.82 1083.62 1089.08 1105.04 1106.35 1139.15 1147.05 1149.57 1150.18 1152.84 1153.20 1178.28 1178.98 1179.61 1192.24 1193.23 1193.57 1195.37 1196.02 1196.65 1225.71 1257.83 1260.06 1266.03 1282.87 1284.96 1286.21 1291.63 1295.14 1297.09 1297.91 1310.02 1314.55 1319.75 1321.45 1334.35 1337.51 1339.79 1344.42 1348.50 1350.50 1376.59 1389.92 1390.69 1393.72 1405.91 1406.79 1407.73 1409.19 1409.66 1410.48 1413.57 1414.47 1415.21 1417.92 1419.98 1421.07 1423.96 1426.71 1429.92 1430.76 1430.99 1441.23 1441.77 1443.49 1471.14 1471.67 1475.19 1475.74 1477.08 1477.55 1478.28 1481.08 1481.74 1482.68 1484.07 1484.32 1485.70 1486.70 1487.59 1488.50 1489.22 1490.12 1490.50 1490.95 1493.25 1494.24 1496.70 1497.43 1499.92 1500.36 1504.60 1509.14 1510.95 1518.13 1539.04 1541.31 1548.99 1646.27 1652.01 1654.09 1687.69 1687.95 1691.03 2424.69 3056.56 3056.95 3058.65 3060.22 3060.47 3061.20 3063.10 3065.27 3066.02 3066.69 3069.70 3072.27 3074.00 3076.18 3076.62 3077.14 3089.27 3092.17 3095.77 3109.12 3122.90 3133.24 3141.29 3141.36 3141.66 3142.30 3144.98 3145.63 3145.74 3147.92 3151.12 3152.55 3155.54 3158.31 3158.52 3159.04 3161.61 3163.02 3168.84 3169.13 3169.26 3170.36 3172.16 3176.51 3177.81 3178.46 3180.02 3180.56 3181.67 3185.03 3185.37 3187.52 3190.44 3215.54 3218.29 3218.66 3218.84 3222.87 3225.45 3239.23 3239.46 3240.28 3259.15
formula: C41H63FeN2P3
InChI: InChI=1/C39H60NP3.C2H3N.Fe/c1-25(2)41(26(3)4)37-22-31(13)16-19-34(37)40(35-20-17-32(14)23-38(35)42(27(5)6)28(7)8)36-21-18-33(15)24-39(36)43(29(9)10)30(11)12;1-2-3;/h16-30H,1-15H3;1H3;/rC39H60NP3.C2H3FeN/c1-25(2)41(26(3)4)37-22-31(13)16-19-34(37)40(35-20-17-32(14)23-38(35)42(27(5)6)28(7)8)36-21-18-33(15)24-39(36)43(29(9)10)30(11)12;1-2-4-3/h16-30H,1-15H3;1H3
110 atoms
Fe -0.321399 1.451993 2.644232
P  -1.085693 -0.777149 1.918891
P  -1.942798 3.18731 2.130878
P  1.898205 2.142165 1.829408
N  -0.491417 1.529215 0.034292
C  0.086309 0.283382 -0.392052
C  0.877993 0.221918 -1.539865
H  1.072561 1.12769 -2.111104
C  1.42007 -0.988989 -1.96039
H  2.041176 -1.011028 -2.856367
C  1.165681 -2.17489 -1.263866
C  0.358916 -2.10043 -0.123451
H  0.155814 -3.02077 0.423583
C  -0.168772 -0.891311 0.339105
C  1.758671 -3.483241 -1.700803
H  1.963087 -3.488774 -2.779005
H  1.091025 -4.322725 -1.467473
H  2.712486 -3.669982 -1.183891
C  -1.907853 1.639093 -0.199301
C  -2.501008 0.965728 -1.270066
H  -1.889215 0.341583 -1.919001
C  -3.8656 1.079736 -1.507311
H  -4.30801 0.535321 -2.342286
C  -4.674089 1.888903 -0.699172
C  -4.065596 2.568113 0.360414
H  -4.692025 3.190821 0.998404
C  -2.69823 2.449586 0.637169
C  -6.146784 2.014377 -0.96168
H  -6.334374 2.416081 -1.96787
H  -6.628401 2.678955 -0.234089
H  -6.640972 1.033729 -0.908738
C  0.244627 2.700778 -0.361703
C  -0.197034 3.475726 -1.437865
H  -1.089234 3.177165 -1.985174
C  0.475535 4.636662 -1.799865
H  0.102853 5.230115 -2.635233
C  1.616494 5.052184 -1.103243
C  2.057927 4.256744 -0.042603
H  2.936702 4.587006 0.504916
C  1.395318 3.085914 0.345894
C  2.345174 6.307302 -1.487144
H  3.113693 6.565445 -0.748245
H  1.652986 7.155827 -1.576656
H  2.840304 6.189079 -2.462427
C  -0.430705 -2.190056 2.942482
H  -0.633231 -3.116345 2.384343
C  1.074829 -2.017824 3.127813
H  1.285924 -1.124515 3.732315
H  1.62173 -1.931687 2.182015
H  1.478086 -2.884563 3.670814
C  -1.101819 -2.285648 4.314158
H  -0.549637 -3.015884 4.923074
H  -2.140075 -2.622077 4.263013
H  -1.075578 -1.325656 4.845956
C  -2.86878 -1.127611 1.458253
H  -3.194287 -0.172033 1.026443
C  -2.994945 -2.210377 0.392668
H  -2.60163 -3.17441 0.747001
H  -2.474298 -1.945525 -0.535646
H  -4.058725 -2.353494 0.151237
C  -3.770101 -1.428711 2.654824
H  -4.814575 -1.257454 2.357943
H  -3.563357 -0.796574 3.526366
H  -3.686728 -2.478782 2.961554
C  -3.336403 3.367628 3.34267
H  -4.123758 3.964334 2.859634
C  -3.889262 1.988256 3.688712
H  -3.129766 1.371511 4.189816
H  -4.244554 1.444849 2.804812
H  -4.738247 2.095007 4.379344
C  -2.876656 4.10427 4.600973
H  -3.662628 4.030538 5.366195
H  -2.698281 5.169576 4.418402
H  -1.960016 3.667145 5.021943
C  -1.379342 4.887464 1.61836
H  -0.756227 4.670774 0.741639
C  -2.532386 5.778156 1.171034
H  -3.197972 6.0373 2.006234
H  -3.132476 5.306008 0.381418
H  -2.12836 6.717436 0.76545
C  -0.489857 5.555749 2.664955
H  0.076835 6.368834 2.189566
H  0.232675 4.858289 3.107754
H  -1.074274 5.994435 3.481984
C  2.856064 3.361411 2.875014
H  2.305886 4.297985 2.698702
C  4.323275 3.595635 2.51596
H  4.691572 4.446977 3.106731
H  4.490066 3.833457 1.459808
H  4.948679 2.731262 2.766989
C  2.707916 3.013992 4.356716
H  3.117469 2.02227 4.591684
H  1.659023 3.038572 4.674348
H  3.256456 3.752597 4.958949
C  3.018298 0.769455 1.233537
H  2.297141 0.030167 0.858634
C  3.930045 1.155767 0.074688
H  4.696286 1.881735 0.372729
H  3.365727 1.576391 -0.767157
H  4.446342 0.254438 -0.287536
C  3.779058 0.126604 2.39236
H  4.192255 -0.835961 2.059089
H  3.137493 -0.070726 3.259757
H  4.619075 0.746286 2.727752
C  -0.27615 1.199746 5.834019
N  -0.274006 1.303676 4.683692
C  -0.277888 1.068228 7.269563
H  0.664921 1.459968 7.674129
H  -0.378852 0.009297 7.542077
H  -1.117548 1.636247 7.69133
elementType: Fe P N C H
totalener: -4005.27028908 hartree
nucrepener: 8865.53677325 hartree
cpcmener: -0.19182966 hartree
kineticenergy: 4071.51558318 hartree
exchangeener: -277.347469788169 hartree
correlationener: -13.578058110064 hartree
xcener: -290.925527898233 hartree
s2: 6.020534
dispersion: -0.184109831 hartree
s2: 6.020136
dispersion: -0.183743017 hartree
s2: 6.020108
dispersion: -0.183818169 hartree
s2: 6.019894
dispersion: -0.183277437 hartree
s2: 6.019818
dispersion: -0.182901238 hartree
dispersion: -0.183278974 hartree
s2: 6.019887
dispersion: -0.183260676 hartree
s2: 6.019975
dispersion: -0.183048809 hartree
s2: 6.020170
dispersion: -0.183311294 hartree
s2: 6.020428
dispersion: -0.183226180 hartree
s2: 6.020585
dispersion: -0.183286791 hartree
s2: 6.020679
dispersion: -0.183608917 hartree
s2: 6.020774
dispersion: -0.183766882 hartree
s2: 6.020859
dispersion: -0.183337267 hartree
s2: 6.020880
dispersion: -0.183586288 hartree
s2: 6.020918
dispersion: -0.183841957 hartree
s2: 6.020966
dispersion: -0.183786218 hartree
s2: 6.020993
dispersion: -0.183752896 hartree
s2: 6.021020
dispersion: -0.183761641 hartree
s2: 6.021039
dispersion: -0.183781708 hartree
s2: 6.021053
dispersion: -0.183789202 hartree
s2: 6.021070
dispersion: -0.183796197 hartree
s2: 6.021083
dispersion: -0.183794479 hartree
s2: 6.021089
dispersion: -0.183786039 hartree
s2: 6.021084
dispersion: -0.183773604 hartree
s2: 6.021073
dispersion: -0.183760817 hartree
s2: 6.021057
dispersion: -0.183750997 hartree
s2: 6.021042
dispersion: -0.183742683 hartree
s2: 6.021032
dispersion: -0.183742216 hartree
s2: 6.021030
chargesum: 2.0000000
charge: 0.418470 0.412124 0.427522 0.433582 -0.417756 0.096785 -0.177917 0.204494 -0.203109 0.185075 0.055889 -0.274788 0.191665 -0.095926 -0.481951 0.194768 0.196509 0.205253 0.066641 -0.172346 0.205946 -0.197465 0.186917 0.056422 -0.289522 0.193620 -0.065893 -0.483499 0.201814 0.194988 0.201605 0.061879 -0.169514 0.202177 -0.200311 0.187022 0.061064 -0.282185 0.190174 -0.072030 -0.485126 0.195318 0.199594 0.204396 -0.423763 0.236395 -0.534745 0.217162 0.221609 0.201792 -0.481553 0.194830 0.196435 0.199097 -0.437807 0.260696 -0.474249 0.193130 0.205088 0.193392 -0.492267 0.196527 0.209072 0.203622 -0.431183 0.237884 -0.530307 0.217239 0.219773 0.200579 -0.485908 0.196042 0.205319 0.198791 -0.438506 0.264334 -0.470315 0.194904 0.196333 0.194993 -0.495379 0.195127 0.222322 0.193316 -0.467166 0.245760 -0.485416 0.196712 0.213576 0.199881 -0.491475 0.196507 0.213089 0.195363 -0.457926 0.263190 -0.462306 0.191967 0.202051 0.190891 -0.491908 0.198350 0.210587 0.199612 0.033788 -0.135501 -0.500421 0.270027 0.268922 0.269648
charge: -0.817391 0.813161 0.826667 0.819691 0.012591 0.003887 -0.148283 0.169660 -0.123002 0.164262 -0.046340 -0.127282 0.161306 -0.168832 -0.384497 0.156288 0.157187 0.163897 0.002320 -0.146741 0.170578 -0.119906 0.165377 -0.044743 -0.132796 0.161490 -0.166713 -0.384509 0.162346 0.154265 0.162234 0.000257 -0.147422 0.170737 -0.122319 0.165321 -0.043820 -0.133169 0.160645 -0.165083 -0.384377 0.154562 0.160734 0.163692 -0.282137 0.159992 -0.395450 0.152192 0.146236 0.156064 -0.395094 0.153300 0.148394 0.146939 -0.281073 0.160933 -0.397031 0.146897 0.145348 0.152574 -0.395679 0.153998 0.145939 0.147194 -0.285248 0.159058 -0.395924 0.152324 0.146712 0.155186 -0.395010 0.153893 0.147651 0.148681 -0.283772 0.164642 -0.397064 0.147398 0.146834 0.153801 -0.394585 0.153651 0.147399 0.146447 -0.287814 0.162233 -0.398048 0.155740 0.145195 0.147113 -0.393641 0.148411 0.149596 0.153027 -0.281511 0.162007 -0.397165 0.146453 0.145328 0.152599 -0.396453 0.155081 0.147159 0.145605 0.163256 0.102898 -0.395152 0.211158 0.209206 0.210175
qa: 0.4185 0.4121 0.4275 0.4336 -0.4178 0.0968 -0.1779 0.2045 -0.2031 0.1851 0.0559 -0.2748 0.1917 -0.0959 -0.4820 0.1948 0.1965 0.2053 0.0666 -0.1723 0.2059 -0.1975 0.1869 0.0564 -0.2895 0.1936 -0.0659 -0.4835 0.2018 0.1950 0.2016 0.0619 -0.1695 0.2022 -0.2003 0.1870 0.0611 -0.2822 0.1902 -0.0720 -0.4851 0.1953 0.1996 0.2044 -0.4238 0.2364 -0.5347 0.2172 0.2216 0.2018 -0.4816 0.1948 0.1964 0.1991 -0.4378 0.2607 -0.4742 0.1931 0.2051 0.1934 -0.4923 0.1965 0.2091 0.2036 -0.4312 0.2379 -0.5303 0.2172 0.2198 0.2006 -0.4859 0.1960 0.2053 0.1988 -0.4385 0.2643 -0.4703 0.1949 0.1963 0.1950 -0.4954 0.1951 0.2223 0.1933 -0.4672 0.2458 -0.4854 0.1967 0.2136 0.1999 -0.4915 0.1965 0.2131 0.1954 -0.4579 0.2632 -0.4623 0.1920 0.2021 0.1909 -0.4919 0.1983 0.2106 0.1996 0.0338 -0.1355 -0.5004 0.2700 0.2689 0.2696
va: 6.2965 3.7286 3.7605 3.7156 3.0477 3.9592 3.8114 0.9307 3.8326 0.9390 3.9135 3.8814 0.9421 3.8555 3.8149 0.9300 0.9283 0.9205 3.9719 3.8087 0.9298 3.8148 0.9373 3.9131 3.9111 0.9443 3.8492 3.8142 0.9229 0.9333 0.9230 3.9847 3.8058 0.9313 3.8158 0.9372 3.9180 3.8978 0.9479 3.8555 3.8151 0.9328 0.9245 0.9215 3.9181 0.9000 3.7720 0.9315 0.9213 0.9269 3.7931 0.9295 0.9378 0.9369 3.9130 0.8695 3.7898 0.9310 0.9268 0.9296 3.7988 0.9263 0.9249 0.9247 3.9269 0.8994 3.7775 0.9306 0.9198 0.9269 3.7877 0.9299 0.9305 0.9355 3.9106 0.8645 3.7967 0.9308 0.9315 0.9278 3.7864 0.9281 0.9265 0.9369 3.9194 0.8932 3.7835 0.9275 0.9237 0.9360 3.7993 0.9314 0.9275 0.9292 3.9212 0.8672 3.7849 0.9363 0.9288 0.9313 3.7805 0.9268 0.9283 0.9353 3.9896 3.2924 3.8079 0.9044 0.9052 0.9047
dispersion: -0.183746707 hartree
energy: -4005.465600443367 hartree
dipole: 3.74123 -3.74777 -0.00654 -1.08065 0.83220 -0.24845 13.58397 -9.54476 4.03921
magnitude: 4.04685 au
magnitude: 10.28628 debye
temp: 298.15 k
press: 1.00 atm
zeropoint: 0.96150203 hartree
thermalvibcorrection: 0.05322736 hartree
thermalrotcorrection: 0.00141627 hartree
thermaltrasncorrection: 0.00141627 hartree
thermaltotal: -4004.44803851 hartree
thermalcorr: 0.05605990 hartree
nonthermalcorr: 0.96150203 hartree
totalcorr: 1.01756193 hartree
thermalcorrenthalpy: 0.00094421 hartree
totalenthalpy: -4004.44709431 hartree
vibrat: 0.09555433 hartree
rotat: 0.01819969 hartree
transl: 0.02169192 hartree
total: 0.13696554 hartree
totalentropycorr: -0.13696554 hartree
gibbsenthalpy: -4004.58405984 hartree
gibbsminuselec: 0.88154060 hartree
