program: Orca
programVersion: 6.0.1
elementType: Fe P P P N C C H C H C C H C C H H H C C H C H C C H C C H H H C C H C H C C H C C H H H C H C H H H C H H H C H C H H H C H H H C H C H H H C H H H C H C H H H C H H H C H C H H H C H H H C H C H H H C H H H C N C H H H
keywords: PBE0 D4 DKH2 DKH-def2-SV(P) def2-tzvp/c Opt Freq UNO UCO NormalPrint CPCM(acetonitrile)
charge: 1
multiplicity: 4
frequency: 0.00 0.00 0.00 0.00 0.00 0.00 -45.51 -18.44 20.85 27.86 33.06 35.66 37.43 39.37 39.55 50.70 54.43 61.01 63.77 74.56 74.98 77.38 83.95 86.16 92.91 96.64 98.38 105.00 109.07 113.28 120.33 123.65 127.19 129.98 142.48 144.83 146.61 150.53 152.63 160.59 165.42 177.35 181.95 183.90 188.03 196.58 202.36 209.54 214.42 222.28 227.82 229.51 232.98 240.07 243.88 244.09 247.45 250.60 251.56 254.49 257.15 260.43 266.51 268.08 274.12 276.89 281.79 296.92 299.63 310.64 323.29 327.38 335.23 341.81 347.80 353.55 365.25 368.86 376.58 382.67 388.22 398.28 408.36 411.82 424.82 427.08 429.90 444.88 451.09 467.10 469.31 474.78 481.68 487.61 495.00 498.98 510.59 523.64 544.71 551.56 562.02 581.78 590.22 594.14 605.15 612.93 625.83 656.21 672.45 674.03 679.77 697.67 698.36 704.17 771.40 773.21 774.32 836.01 840.07 850.97 881.05 884.18 905.04 909.22 917.33 919.50 921.56 921.80 922.80 923.37 927.76 930.01 937.85 938.32 942.63 945.41 946.93 951.06 955.49 956.13 977.23 981.43 982.01 983.00 983.70 988.43 989.40 990.02 991.80 992.78 1021.84 1023.09 1023.99 1044.01 1044.76 1045.34 1047.61 1048.67 1064.33 1064.40 1064.80 1066.08 1069.71 1079.17 1089.62 1105.79 1106.14 1134.52 1145.13 1146.89 1148.02 1150.04 1152.15 1171.49 1172.67 1173.10 1190.98 1191.99 1192.25 1193.46 1194.24 1195.01 1232.45 1258.31 1260.41 1264.07 1277.12 1279.27 1283.35 1294.15 1294.81 1301.92 1302.69 1305.98 1309.84 1331.98 1337.20 1337.51 1340.70 1342.88 1346.82 1348.62 1351.68 1370.68 1385.68 1386.51 1398.50 1402.62 1403.03 1403.53 1404.54 1405.84 1406.37 1413.37 1413.90 1414.16 1414.28 1414.78 1416.24 1418.79 1420.04 1426.24 1439.37 1439.88 1440.04 1441.34 1442.83 1471.60 1472.04 1474.69 1475.70 1475.98 1477.15 1478.83 1479.78 1481.44 1482.60 1483.18 1484.43 1484.80 1485.83 1486.75 1487.94 1488.31 1488.53 1489.19 1489.99 1491.71 1492.74 1495.31 1496.69 1499.59 1499.72 1503.97 1508.29 1509.83 1517.13 1540.00 1541.70 1549.22 1642.22 1648.06 1649.70 1685.84 1686.35 1690.79 2383.49 3048.33 3049.09 3053.84 3054.54 3056.09 3056.14 3056.71 3057.07 3057.83 3057.91 3062.18 3063.61 3064.35 3067.34 3068.32 3072.86 3080.13 3086.07 3089.41 3105.84 3116.91 3123.81 3130.36 3135.21 3135.52 3135.54 3136.55 3136.73 3138.69 3138.81 3139.88 3142.93 3144.86 3148.00 3149.56 3150.15 3153.44 3154.91 3162.99 3163.80 3164.03 3165.89 3166.87 3168.04 3173.32 3174.91 3175.28 3176.71 3177.05 3177.99 3178.64 3181.05 3185.66 3209.85 3210.17 3210.21 3210.60 3220.70 3221.61 3230.29 3231.87 3232.40 3260.11
frequency: 20.85 27.86 33.06 35.66 37.43 39.37 39.55 50.70 54.43 61.01 63.77 74.56 74.98 77.38 83.95 86.16 92.91 96.64 98.38 105.00 109.07 113.28 120.33 123.65 127.19 129.98 142.48 144.83 146.61 150.53 152.63 160.59 165.42 177.35 181.95 183.90 188.03 196.58 202.36 209.54 214.42 222.28 227.82 229.51 232.98 240.07 243.88 244.09 247.45 250.60 251.56 254.49 257.15 260.43 266.51 268.08 274.12 276.89 281.79 296.92 299.63 310.64 323.29 327.38 335.23 341.81 347.80 353.55 365.25 368.86 376.58 382.67 388.22 398.28 408.36 411.82 424.82 427.08 429.90 444.88 451.09 467.10 469.31 474.78 481.68 487.61 495.00 498.98 510.59 523.64 544.71 551.56 562.02 581.78 590.22 594.14 605.15 612.93 625.83 656.21 672.45 674.03 679.77 697.67 698.36 704.17 771.40 773.21 774.32 836.01 840.07 850.97 881.05 884.18 905.04 909.22 917.33 919.50 921.56 921.80 922.80 923.37 927.76 930.01 937.85 938.32 942.63 945.41 946.93 951.06 955.49 956.13 977.23 981.43 982.01 983.00 983.70 988.43 989.40 990.02 991.80 992.78 1021.84 1023.09 1023.99 1044.01 1044.76 1045.34 1047.61 1048.67 1064.33 1064.40 1064.80 1066.08 1069.71 1079.17 1089.62 1105.79 1106.14 1134.52 1145.13 1146.89 1148.02 1150.04 1152.15 1171.49 1172.67 1173.10 1190.98 1191.99 1192.25 1193.46 1194.24 1195.01 1232.45 1258.31 1260.41 1264.07 1277.12 1279.27 1283.35 1294.15 1294.81 1301.92 1302.69 1305.98 1309.84 1331.98 1337.20 1337.51 1340.70 1342.88 1346.82 1348.62 1351.68 1370.68 1385.68 1386.51 1398.50 1402.62 1403.03 1403.53 1404.54 1405.84 1406.37 1413.37 1413.90 1414.16 1414.28 1414.78 1416.24 1418.79 1420.04 1426.24 1439.37 1439.88 1440.04 1441.34 1442.83 1471.60 1472.04 1474.69 1475.70 1475.98 1477.15 1478.83 1479.78 1481.44 1482.60 1483.18 1484.43 1484.80 1485.83 1486.75 1487.94 1488.31 1488.53 1489.19 1489.99 1491.71 1492.74 1495.31 1496.69 1499.59 1499.72 1503.97 1508.29 1509.83 1517.13 1540.00 1541.70 1549.22 1642.22 1648.06 1649.70 1685.84 1686.35 1690.79 2383.49 3048.33 3049.09 3053.84 3054.54 3056.09 3056.14 3056.71 3057.07 3057.83 3057.91 3062.18 3063.61 3064.35 3067.34 3068.32 3072.86 3080.13 3086.07 3089.41 3105.84 3116.91 3123.81 3130.36 3135.21 3135.52 3135.54 3136.55 3136.73 3138.69 3138.81 3139.88 3142.93 3144.86 3148.00 3149.56 3150.15 3153.44 3154.91 3162.99 3163.80 3164.03 3165.89 3166.87 3168.04 3173.32 3174.91 3175.28 3176.71 3177.05 3177.99 3178.64 3181.05 3185.66 3209.85 3210.17 3210.21 3210.60 3220.70 3221.61 3230.29 3231.87 3232.40 3260.11
formula: C41H63FeN2P3
InChI: InChI=1/C39H60NP3.C2H3N.Fe/c1-25(2)41(26(3)4)37-22-31(13)16-19-34(37)40(35-20-17-32(14)23-38(35)42(27(5)6)28(7)8)36-21-18-33(15)24-39(36)43(29(9)10)30(11)12;1-2-3;/h16-30H,1-15H3;1H3;/rC41H63FeN2P3/c1-17-43-42-45(27(2)3,28(4)5)39-24-33(14)18-21-36(39)44(37-22-19-34(15)25-40(37)46(42,29(6)7)30(8)9)38-23-20-35(16)26-41(38)47(42,31(10)11)32(12)13/h18-32H,1-16H3
110 atoms
Fe -0.313721 1.454585 2.777938
P  -1.040227 -0.672317 1.932306
P  -1.867407 3.095436 2.127662
P  1.78375 2.113249 1.831232
N  -0.50765 1.535987 -0.109209
C  0.071173 0.285678 -0.467663
C  0.863855 0.182223 -1.614947
H  1.036335 1.068001 -2.224402
C  1.426078 -1.035114 -1.985459
H  2.045058 -1.089174 -2.882044
C  1.18737 -2.191189 -1.234741
C  0.382599 -2.075089 -0.095984
H  0.195788 -2.975681 0.488174
C  -0.159937 -0.855661 0.324245
C  1.797897 -3.510796 -1.613836
H  1.964692 -3.578859 -2.696835
H  1.159899 -4.350342 -1.308023
H  2.774236 -3.647162 -1.123445
C  -1.918312 1.654706 -0.280796
C  -2.55143 1.001405 -1.343129
H  -1.956743 0.394368 -2.024558
C  -3.924295 1.1147 -1.531132
H  -4.397263 0.586057 -2.359976
C  -4.700091 1.910226 -0.679266
C  -4.051453 2.567704 0.371633
H  -4.658731 3.175999 1.041379
C  -2.676784 2.441733 0.608018
C  -6.182808 2.044063 -0.882954
H  -6.412035 2.455158 -1.876916
H  -6.631547 2.705179 -0.130994
H  -6.682363 1.066577 -0.816729
C  0.242065 2.700409 -0.446888
C  -0.171709 3.50459 -1.51523
H  -1.050317 3.214084 -2.089371
C  0.506812 4.674672 -1.833847
H  0.155907 5.290313 -2.663159
C  1.633151 5.065223 -1.100323
C  2.044183 4.242804 -0.046951
H  2.909365 4.563375 0.526811
C  1.371382 3.066344 0.308549
C  2.381752 6.323198 -1.438675
H  3.121385 6.568231 -0.666084
H  1.699139 7.177834 -1.544699
H  2.917526 6.218134 -2.394148
C  -0.426298 -2.144015 2.916086
H  -0.662789 -3.063361 2.359562
C  1.0842 -2.024895 3.10257
H  1.316154 -1.15153 3.727589
H  1.633134 -1.920268 2.159777
H  1.468492 -2.916531 3.620183
C  -1.080007 -2.22673 4.297965
H  -0.542557 -2.971666 4.903766
H  -2.129116 -2.53077 4.26369
H  -1.01817 -1.265409 4.825008
C  -2.818571 -1.075793 1.446524
H  -3.158697 -0.126851 1.011045
C  -2.934623 -2.159194 0.380265
H  -2.5129 -3.11517 0.725232
H  -2.429672 -1.881366 -0.552769
H  -3.996966 -2.331699 0.147817
C  -3.733951 -1.395707 2.627548
H  -4.779042 -1.233269 2.325187
H  -3.542093 -0.771973 3.50796
H  -3.643966 -2.448028 2.926998
C  -3.288579 3.325252 3.315994
H  -4.063965 3.937917 2.833805
C  -3.872747 1.962614 3.671721
H  -3.118692 1.33645 4.169238
H  -4.233776 1.420064 2.789455
H  -4.720422 2.083726 4.363013
C  -2.822665 4.050125 4.578828
H  -3.609093 3.991032 5.345947
H  -2.620597 5.112235 4.400927
H  -1.914099 3.592816 4.996912
C  -1.362259 4.827238 1.614571
H  -0.749947 4.628842 0.725568
C  -2.5259 5.715992 1.193401
H  -3.177878 5.967744 2.042214
H  -3.141589 5.241651 0.416981
H  -2.142486 6.662338 0.7820
C  -0.458649 5.503602 2.643754
H  0.112406 6.311843 2.16361
H  0.260227 4.800294 3.083732
H  -1.031431 5.950158 3.465629
C  2.782039 3.351144 2.84214
H  2.245561 4.291931 2.648442
C  4.255587 3.578176 2.501281
H  4.62093 4.442816 3.075928
H  4.441355 3.788388 1.442427
H  4.877268 2.719679 2.78115
C  2.627314 3.043147 4.331644
H  3.056189 2.065736 4.593553
H  1.574098 3.040768 4.635899
H  3.152359 3.807174 4.924682
C  2.95837 0.769945 1.239321
H  2.256182 0.013823 0.861645
C  3.881929 1.149158 0.087507
H  4.6336 1.891303 0.383479
H  3.322319 1.551628 -0.766487
H  4.418339 0.252482 -0.259695
C  3.71943 0.143466 2.406952
H  4.129702 -0.829645 2.099188
H  3.078268 -0.029753 3.279704
H  4.562715 0.765557 2.730225
C  -0.271437 1.187712 5.914729
N  -0.269632 1.290862 4.760428
C  -0.27554 1.056968 7.35532
H  0.657647 1.459787 7.77086
H  -0.363455 -0.001323 7.635066
H  -1.123289 1.610668 7.780104
elementType: Fe P N C H
totalener: -4005.40462845962793 hartree
nucrepener: 8831.95755295408708 hartree
cpcmener: -0.05727519749088 hartree
kineticenergy: 4071.57075575803628 hartree
exchangeener: -277.533711033729 hartree
correlationener: -13.620507106539 hartree
xcener: -291.154218140268 hartree
s2: 3.801189
dispersion: -0.186062581 hartree
s2: 3.800292
dispersion: -0.185656265 hartree
s2: 3.798388
dispersion: -0.185710897 hartree
s2: 3.797011
dispersion: -0.186599187 hartree
s2: 3.796735
dispersion: -0.186766291 hartree
s2: 3.796663
dispersion: -0.186816299 hartree
s2: 3.796287
dispersion: -0.187477729 hartree
s2: 3.795963
dispersion: -0.187900244 hartree
s2: 3.795873
dispersion: -0.187632105 hartree
s2: 3.795871
dispersion: -0.187552242 hartree
s2: 3.795791
dispersion: -0.187930174 hartree
s2: 3.795862
dispersion: -0.187711106 hartree
s2: 3.795803
dispersion: -0.187665293 hartree
s2: 3.795762
dispersion: -0.187718336 hartree
s2: 3.795897
dispersion: -0.187773394 hartree
s2: 3.795836
dispersion: -0.187684345 hartree
s2: 3.795800
dispersion: -0.187676444 hartree
s2: 3.795830
dispersion: -0.187688583 hartree
s2: 3.795838
dispersion: -0.187671333 hartree
s2: 3.795839
dispersion: -0.187658178 hartree
s2: 3.795850
dispersion: -0.187640188 hartree
s2: 3.795853
energy: -7034.6752 -2107.1677 -2107.1433 -2107.0816 -831.7261 -707.3309 -707.3026 -707.2421 -392.7495 -392.5455 -280.3829 -279.7602 -279.7564 -279.7457 -279.2327 -278.8831 -278.8420 -278.8410 -278.8252 -278.8215 -278.7876 -278.7251 -278.6777 -278.6268 -278.6266 -278.6256 -278.5898 -278.5719 -278.5655 -278.5562 -278.5506 -278.5424 -278.5249 -278.5176 -278.5124 -278.4980 -278.0032 -278.0005 -277.9925 -277.9201 -277.9087 -277.8891 -277.8724 -277.8720 -277.8714 -277.8657 -277.8637 -277.8631 -277.8557 -277.8252 -277.8052 -181.2264 -181.2009 -181.1473 -129.7222 -129.7083 -129.6970 -129.6809 -129.6434 -129.6259 -129.6255 -129.6021 -129.5484 -97.0788 -61.8840 -61.7575 -61.6162 -27.2504 -26.0194 -24.2264 -24.2132 -23.7332 -22.5958 -22.5650 -22.5487 -21.8691 -21.8483 -21.7873 -21.7681 -21.7482 -21.5659 -21.0781 -21.0226 -21.0031 -20.9696 -19.4067 -19.3967 -19.1239 -19.0787 -19.0596 -18.9827 -18.9517 -18.8265 -18.6011 -18.3477 -18.3215 -18.2128 -17.2111 -17.2104 -17.1791 -16.4833 -16.4689 -16.2927 -16.2175 -16.1918 -15.8370 -15.2294 -15.2092 -14.9280 -14.7356 -14.6956 -14.6087 -14.0188 -13.4789 -13.4526 -13.4257 -13.2351 -13.2060 -13.0996 -13.0221 -12.9899 -12.9070 -12.8885 -12.8336 -12.6817 -12.6767 -12.6709 -12.5019 -12.4259 -12.3652 -12.3141 -12.2548 -12.2402 -12.0350 -11.9549 -11.9108 -11.8846 -11.8246 -11.8057 -11.6284 -11.5670 -11.5328 -11.5093 -11.2940 -11.2536 -11.2110 -10.9590 -10.9431 -10.9209 -10.8659 -10.8652 -10.8332 -10.7952 -10.7620 -10.7311 -10.6872 -10.6540 -10.5367 -10.4903 -10.4045 -10.3535 -10.3319 -10.2796 -10.0887 -10.0794 -9.9968 -9.8971 -9.8380 -9.8160 -9.7496 -9.6859 -9.6516 -9.6391 -9.6097 -9.6013 -9.4984 -9.4377 -9.1987 -8.9824 -8.9728 -8.8266 -8.5844 -8.5424 -8.4881 -8.3307 -8.3003 -8.2187 -7.5861 -7.5268 -7.4821 -7.3116 -7.2850 -6.3965 -6.3696 -6.3249 -5.8529 -5.7480 -5.6276 -0.9820 -0.9470 -0.9121 -0.3666 -0.3446 0.2029 0.3175 0.3239 0.8819 1.3183 1.4109 electronvolt
energy: -7034.6654 -2107.1701 -2107.1450 -2107.0835 -830.2142 -706.0253 -706.0148 -705.9933 -392.7328 -392.5567 -280.3606 -279.7592 -279.7558 -279.7449 -279.2330 -278.8835 -278.8424 -278.8406 -278.8252 -278.8217 -278.7876 -278.7234 -278.6766 -278.6268 -278.6258 -278.6255 -278.5895 -278.5729 -278.5656 -278.5562 -278.5509 -278.5429 -278.5246 -278.5170 -278.5127 -278.4976 -278.0032 -278.0004 -277.9924 -277.9195 -277.9085 -277.8888 -277.8713 -277.8710 -277.8702 -277.8637 -277.8629 -277.8622 -277.8556 -277.8247 -277.8045 -181.2290 -181.2026 -181.1491 -129.7240 -129.7105 -129.6981 -129.6825 -129.6446 -129.6329 -129.6276 -129.6080 -129.5549 -93.1818 -57.5883 -57.5680 -57.5143 -27.2297 -25.9976 -24.2253 -24.2120 -23.7301 -22.5918 -22.5616 -22.5454 -21.8672 -21.8466 -21.7858 -21.7666 -21.7463 -21.5604 -21.0766 -21.0217 -21.0019 -20.9673 -19.4049 -19.3949 -19.1220 -19.0766 -19.0577 -18.9808 -18.9499 -18.8252 -18.5960 -18.3429 -18.3158 -18.2070 -17.2099 -17.2093 -17.1741 -16.4808 -16.4667 -16.2906 -16.2147 -16.1894 -15.8342 -15.2257 -15.2052 -14.9022 -14.7286 -14.6867 -14.5530 -14.0029 -13.4770 -13.4499 -13.4223 -13.2220 -13.1832 -13.0869 -13.0056 -12.9752 -12.8782 -12.8395 -12.7375 -12.6747 -12.6720 -12.6497 -12.4933 -12.4191 -12.3594 -12.3066 -12.2516 -12.2296 -12.0331 -11.9482 -11.9091 -11.8824 -11.8231 -11.8036 -11.6147 -11.5563 -11.5187 -11.5031 -11.2865 -11.2433 -11.2032 -10.9550 -10.9388 -10.9170 -10.8637 -10.8525 -10.8288 -10.7897 -10.7561 -10.7259 -10.6767 -10.6416 -10.5321 -10.4849 -10.3985 -10.3241 -10.2894 -10.2650 -10.0854 -10.0759 -9.9919 -9.8949 -9.8340 -9.8090 -9.7461 -9.6797 -9.6424 -9.6323 -9.6051 -9.5908 -9.4907 -9.4267 -9.1448 -8.9663 -8.9600 -8.7292 -8.4836 -8.4367 -8.3471 -7.9905 -7.6573 -7.5954 -7.4746 -7.4644 -7.3918 -6.9913 -6.9572 -6.0127 -4.5643 -4.5489 -1.0573 -1.0276 -1.0003 -0.5161 -0.5054 -0.2421 -0.2191 0.1108 0.3557 1.0931 1.1222 electronvolt
chargesum: 1.0000000
charge: 0.082760 0.446663 0.446572 0.464693 -0.375009 0.107003 -0.183185 0.188211 -0.219171 0.174621 0.056815 -0.292109 0.179190 -0.108966 -0.483182 0.189634 0.191195 0.199443 0.077776 -0.178096 0.189645 -0.215285 0.175897 0.057250 -0.306627 0.180712 -0.072949 -0.484799 0.195478 0.190223 0.195788 0.066295 -0.177409 0.187500 -0.216943 0.176492 0.062607 -0.299850 0.178572 -0.079444 -0.485862 0.190598 0.193690 0.198328 -0.424989 0.215152 -0.522736 0.208610 0.211841 0.186932 -0.483576 0.182432 0.186618 0.195123 -0.439563 0.250879 -0.468885 0.181845 0.196054 0.180024 -0.491017 0.184755 0.200982 0.193586 -0.429145 0.216741 -0.521041 0.212025 0.209605 0.185625 -0.485281 0.183964 0.195085 0.192278 -0.436404 0.252508 -0.469456 0.184430 0.187139 0.181837 -0.492744 0.182457 0.214647 0.182784 -0.473421 0.227434 -0.480719 0.183931 0.205413 0.189943 -0.485279 0.184382 0.211664 0.181078 -0.454002 0.251582 -0.457293 0.180608 0.192399 0.176754 -0.490029 0.186086 0.201472 0.188829 -0.026868 -0.113674 -0.497516 0.254006 0.253262 0.254074
charge: -1.281114 0.831389 0.847451 0.837708 0.000279 0.003600 -0.154560 0.162387 -0.138107 0.158134 -0.058116 -0.139142 0.154658 -0.164603 -0.385789 0.153382 0.153683 0.159974 0.002354 -0.153117 0.162933 -0.136202 0.158866 -0.056779 -0.145190 0.154466 -0.164422 -0.385876 0.158209 0.151386 0.158380 -0.001031 -0.155367 0.163487 -0.137719 0.159085 -0.055390 -0.145029 0.155060 -0.163033 -0.385616 0.151734 0.156899 0.159717 -0.287826 0.147864 -0.394573 0.148995 0.141838 0.147183 -0.396785 0.145792 0.143579 0.145686 -0.287524 0.156023 -0.397417 0.140595 0.141279 0.144476 -0.396349 0.146708 0.141859 0.141795 -0.288713 0.147305 -0.394535 0.150116 0.142523 0.146148 -0.395228 0.146633 0.142483 0.146357 -0.291046 0.159413 -0.398568 0.141633 0.142036 0.145742 -0.395527 0.145760 0.143677 0.140816 -0.293081 0.152980 -0.399357 0.148261 0.140756 0.142317 -0.391927 0.142857 0.150106 0.144349 -0.287330 0.156403 -0.398110 0.140832 0.141060 0.144335 -0.396661 0.147345 0.143002 0.140306 0.092689 0.141547 -0.398988 0.199498 0.198465 0.199107
qa: 0.0828 0.4467 0.4466 0.4647 -0.3750 0.1070 -0.1832 0.1882 -0.2192 0.1746 0.0568 -0.2921 0.1792 -0.1090 -0.4832 0.1896 0.1912 0.1994 0.0778 -0.1781 0.1896 -0.2153 0.1759 0.0573 -0.3066 0.1807 -0.0729 -0.4848 0.1955 0.1902 0.1958 0.0663 -0.1774 0.1875 -0.2169 0.1765 0.0626 -0.2999 0.1786 -0.0794 -0.4859 0.1906 0.1937 0.1983 -0.4250 0.2152 -0.5227 0.2086 0.2118 0.1869 -0.4836 0.1824 0.1866 0.1951 -0.4396 0.2509 -0.4689 0.1818 0.1961 0.1800 -0.4910 0.1848 0.2010 0.1936 -0.4291 0.2167 -0.5210 0.2120 0.2096 0.1856 -0.4853 0.1840 0.1951 0.1923 -0.4364 0.2525 -0.4695 0.1844 0.1871 0.1818 -0.4927 0.1825 0.2146 0.1828 -0.4734 0.2274 -0.4807 0.1839 0.2054 0.1899 -0.4853 0.1844 0.2117 0.1811 -0.4540 0.2516 -0.4573 0.1806 0.1924 0.1768 -0.4900 0.1861 0.2015 0.1888 -0.0269 -0.1137 -0.4975 0.2540 0.2533 0.2541
va: 5.3190 3.6767 3.7182 3.6674 3.0896 3.9955 3.7994 0.9377 3.8282 0.9411 3.9006 3.8771 0.9442 3.8393 3.8175 0.9306 0.9299 0.9215 4.0058 3.7974 0.9369 3.8145 0.9396 3.9015 3.9055 0.9468 3.8248 3.8169 0.9242 0.9343 0.9240 4.0141 3.7940 0.9377 3.8144 0.9395 3.9038 3.8905 0.9493 3.8271 3.8178 0.9336 0.9259 0.9225 3.9156 0.9069 3.7818 0.9330 0.9252 0.9294 3.8009 0.9316 0.9395 0.9411 3.9157 0.8727 3.8018 0.9342 0.9292 0.9318 3.8097 0.9282 0.9287 0.9255 3.9275 0.9065 3.7868 0.9320 0.9236 0.9295 3.7961 0.9320 0.9328 0.9405 3.9062 0.8700 3.8086 0.9328 0.9352 0.9297 3.7974 0.9303 0.9290 0.9382 3.9215 0.9008 3.7927 0.9295 0.9247 0.9377 3.8109 0.9341 0.9279 0.9309 3.9229 0.8715 3.7970 0.9391 0.9319 0.9335 3.7922 0.9287 0.9332 0.9367 3.9771 3.2881 3.8275 0.9091 0.9097 0.9094
dispersion: -0.187639625 hartree
energy: -4005.599400725560 hartree
dipole: 3.731237491 -3.771840872 -0.040603381 -1.115279954 0.878476038 -0.236803915 13.205828082 -10.453573414 2.752254668
dipolemethod: SCF
magnitude: 2.762721572 au
magnitude: 7.022280167 debye
temp: 298.15 k
press: 1.00 atm
zeropoint: 0.95967199 hartree
thermalvibcorrection: 0.05323964 hartree
thermalrotcorrection: 0.00141627 hartree
thermaltrasncorrection: 0.00141627 hartree
thermaltotal: -4004.58365655 hartree
thermalcorr: 0.05607218 hartree
nonthermalcorr: 0.95967199 hartree
totalcorr: 1.01574417 hartree
thermalcorrenthalpy: 0.00094421 hartree
totalenthalpy: -4004.58271234 hartree
vibrat: 0.09538537 hartree
rotat: 0.01819138 hartree
transl: 0.02169192 hartree
total: 0.13657758 hartree
totalentropycorr: -0.13657758 hartree
gibbsenthalpy: -4004.71928993 hartree
gibbsminuselec: 0.88011080 hartree
