program: Orca
programVersion: 6.1.x
elementType: C H C C C H C C C H C C C H C C H C H C H C H C C C H C H C H C H C C H C H C H C H C C C H C H C H C H Ir N N N N H H C C C H H H C H H H C H H H C H H H C H H H C H H H
keywords: PBE0 D4 DLU-X2C x2c-SV(P)all x2c/J Opt Freq UNO NormalPrint CPCM(acetonitrile)
charge: 0
multiplicity: 2
frequency: 0.00 0.00 0.00 0.00 0.00 0.00 14.36 16.67 23.54 32.35 33.92 34.94 37.38 40.02 71.40 73.56 80.24 81.43 84.35 89.39 126.25 132.12 148.17 152.93 156.35 177.97 181.86 192.39 200.38 215.51 216.16 236.58 244.31 248.05 254.47 267.44 276.55 278.92 286.64 288.05 294.79 303.76 315.48 322.41 332.64 337.44 338.76 346.10 348.48 354.08 367.10 386.17 391.18 398.25 404.53 416.37 418.51 433.41 434.99 438.44 468.26 473.77 479.00 485.78 498.83 503.32 513.66 528.94 535.34 558.08 568.15 576.88 581.03 582.28 641.96 642.52 662.50 670.57 672.42 674.25 680.76 688.11 729.24 732.97 750.81 757.13 758.80 760.74 760.81 767.61 777.05 778.98 779.53 779.97 780.68 782.21 821.62 833.53 834.39 873.34 884.29 885.41 895.74 896.95 910.72 911.60 921.35 948.16 948.74 955.58 956.30 960.08 960.85 970.92 972.27 974.73 974.83 991.75 992.20 1017.35 1017.42 1021.48 1026.43 1026.59 1036.10 1037.93 1039.62 1043.15 1045.05 1045.45 1047.60 1057.15 1060.46 1062.17 1072.93 1075.50 1084.33 1086.94 1093.71 1097.08 1131.61 1136.20 1139.17 1141.86 1145.22 1145.49 1151.10 1159.27 1159.44 1163.39 1164.22 1168.35 1242.55 1243.37 1244.61 1245.94 1262.91 1265.69 1268.11 1290.30 1298.30 1307.55 1308.61 1315.72 1347.09 1347.52 1354.83 1357.84 1357.94 1368.44 1380.11 1380.35 1381.34 1382.47 1383.01 1387.74 1391.63 1406.39 1407.45 1440.07 1453.04 1453.39 1455.38 1455.68 1458.63 1459.92 1463.03 1466.18 1470.37 1471.73 1474.37 1474.67 1477.48 1485.70 1485.98 1486.54 1493.14 1498.75 1502.42 1526.31 1532.78 1535.64 1539.46 1557.06 1580.44 1625.69 1626.35 1647.55 1647.92 1655.81 1662.50 1665.93 1669.68 1692.22 1692.33 3025.82 3026.21 3027.49 3027.60 3033.10 3033.47 3115.59 3116.83 3117.18 3118.02 3122.02 3122.68 3125.66 3126.86 3129.00 3129.41 3130.50 3130.56 3177.76 3178.09 3190.62 3190.73 3195.48 3195.55 3205.08 3207.13 3212.36 3212.45 3216.10 3217.35 3217.38 3227.08 3234.57 3234.92 3238.44 3238.89 3243.85 3250.46 3252.49 3252.81
frequency: 14.36 16.67 23.54 32.35 33.92 34.94 37.38 40.02 71.40 73.56 80.24 81.43 84.35 89.39 126.25 132.12 148.17 152.93 156.35 177.97 181.86 192.39 200.38 215.51 216.16 236.58 244.31 248.05 254.47 267.44 276.55 278.92 286.64 288.05 294.79 303.76 315.48 322.41 332.64 337.44 338.76 346.10 348.48 354.08 367.10 386.17 391.18 398.25 404.53 416.37 418.51 433.41 434.99 438.44 468.26 473.77 479.00 485.78 498.83 503.32 513.66 528.94 535.34 558.08 568.15 576.88 581.03 582.28 641.96 642.52 662.50 670.57 672.42 674.25 680.76 688.11 729.24 732.97 750.81 757.13 758.80 760.74 760.81 767.61 777.05 778.98 779.53 779.97 780.68 782.21 821.62 833.53 834.39 873.34 884.29 885.41 895.74 896.95 910.72 911.60 921.35 948.16 948.74 955.58 956.30 960.08 960.85 970.92 972.27 974.73 974.83 991.75 992.20 1017.35 1017.42 1021.48 1026.43 1026.59 1036.10 1037.93 1039.62 1043.15 1045.05 1045.45 1047.60 1057.15 1060.46 1062.17 1072.93 1075.50 1084.33 1086.94 1093.71 1097.08 1131.61 1136.20 1139.17 1141.86 1145.22 1145.49 1151.10 1159.27 1159.44 1163.39 1164.22 1168.35 1242.55 1243.37 1244.61 1245.94 1262.91 1265.69 1268.11 1290.30 1298.30 1307.55 1308.61 1315.72 1347.09 1347.52 1354.83 1357.84 1357.94 1368.44 1380.11 1380.35 1381.34 1382.47 1383.01 1387.74 1391.63 1406.39 1407.45 1440.07 1453.04 1453.39 1455.38 1455.68 1458.63 1459.92 1463.03 1466.18 1470.37 1471.73 1474.37 1474.67 1477.48 1485.70 1485.98 1486.54 1493.14 1498.75 1502.42 1526.31 1532.78 1535.64 1539.46 1557.06 1580.44 1625.69 1626.35 1647.55 1647.92 1655.81 1662.50 1665.93 1669.68 1692.22 1692.33 3025.82 3026.21 3027.49 3027.60 3033.10 3033.47 3115.59 3116.83 3117.18 3118.02 3122.02 3122.68 3125.66 3126.86 3129.00 3129.41 3130.50 3130.56 3177.76 3178.09 3190.62 3190.73 3195.48 3195.55 3205.08 3207.13 3212.36 3212.45 3216.10 3217.35 3217.38 3227.08 3234.57 3234.92 3238.44 3238.89 3243.85 3250.46 3252.49 3252.81
formula: C40H40IrN4
InChI: InChI=1/C18H24N2.2C11H8N.Ir/c1-17(2,3)13-7-9-19-15(11-13)16-12-14(8-10-20-16)18(4,5)6;2*1-2-6-10(7-3-1)11-8-4-5-9-12-11;/h7-12H,1-6H3;2*1-6,8-9H;/q-2;2*-1;+4/rC40H40IrN4/c1-39(2,3)29-21-25-44-37(27-29)38-28-30(40(4,5)6)22-26-45(38)41(44,33-17-9-7-15-31(33)35-19-11-13-23-42(35)41)34-18-10-8-16-32(34)36-20-12-14-24-43(36)41/h7-28H,1-6H3
85 atoms
C  -1.534915 2.771118 -0.137921
H  -0.52513 3.192529 -0.158724
C  -2.642684 3.590976 -0.217992
C  -3.945847 3.006387 -0.182078
C  -4.012738 1.634976 -0.076513
H  -4.980867 1.135726 -0.048464
C  -2.84074 0.828537 -0.00132
C  -2.849825 -0.590512 0.107807
C  -4.024746 -1.388428 0.160651
H  -4.993203 -0.886962 0.109678
C  -3.971891 -2.763534 0.27654
C  -2.681386 -3.357111 0.343682
C  -1.563849 -2.542612 0.281222
H  -0.558612 -2.972968 0.325153
C  1.475088 1.482762 -0.117322
C  2.180472 2.170595 0.884844
H  1.971277 1.956858 1.938232
C  3.145492 3.127763 0.570334
H  3.676825 3.648489 1.374555
C  3.442344 3.429115 -0.76429
H  4.199075 4.180814 -1.007598
C  2.766971 2.762605 -1.781304
H  3.000362 2.997862 -2.824192
C  1.797169 1.800294 -1.463177
C  1.040062 1.052109 -2.4632
C  1.172926 1.174918 -3.850977
H  1.893796 1.883041 -4.262919
C  0.391458 0.398357 -4.695013
H  0.493531 0.490771 -5.779925
C  -0.523082 -0.497411 -4.138785
H  -1.161306 -1.128776 -4.760674
C  -0.613541 -0.577595 -2.757838
H  -1.308633 -1.260979 -2.266936
C  1.456665 -1.287225 0.324596
C  2.181133 -1.981263 -0.659513
H  2.000875 -1.76528 -1.717803
C  3.129033 -2.947315 -0.320996
H  3.676009 -3.47266 -1.111614
C  3.388749 -3.251836 1.020614
H  4.13203 -4.010572 1.282799
C  2.693699 -2.57958 2.020464
H  2.898201 -2.817572 3.068779
C  1.741223 -1.608266 1.678118
C  0.965691 -0.853392 2.659014
C  1.061028 -0.978807 4.049621
H  1.763675 -1.694615 4.479308
C  0.265643 -0.195119 4.873912
H  0.338525 -0.289585 5.961006
C  -0.6251 0.71022 4.295162
H  -1.272897 1.347372 4.901032
C  -0.678952 0.792397 2.912413
H  -1.354342 1.482723 2.403978
Ir 0.035515 0.104913 0.085854
N  -1.600374 1.438687 -0.024699
N  -1.615957 -1.213422 0.159934
N  0.144199 0.169762 -1.942963
N  0.092333 0.038141 2.116844
H  -2.498392 4.669558 -0.304514
H  -2.541319 -4.433265 0.44031
C  -5.17973 3.899672 -0.254511
C  -5.261987 -3.584432 0.3262
C  -4.983879 -5.082862 0.467988
H  -5.939841 -5.634256 0.4988
H  -4.398986 -5.472729 -0.382999
H  -4.434418 -5.31119 1.397752
C  -6.053973 -3.3585 -0.971232
H  -5.465783 -3.675668 -1.850695
H  -6.99053 -3.945238 -0.9549
H  -6.321387 -2.296289 -1.104555
C  -5.14023 4.710154 -1.56015
H  -4.237642 5.341727 -1.622847
H  -5.150876 4.040157 -2.438286
H  -6.021871 5.373312 -1.622701
C  -6.48133 3.097031 -0.220874
H  -7.342862 3.785331 -0.273915
H  -6.553706 2.401461 -1.074982
H  -6.576047 2.511776 0.710183
C  -5.168663 4.862325 0.94385
H  -6.047782 5.530765 0.904641
H  -5.204256 4.303179 1.89585
H  -4.264018 5.494263 0.952503
C  -6.107682 -3.131929 1.526693
H  -6.380632 -2.065276 1.453761
H  -7.042875 -3.718592 1.576764
H  -5.557857 -3.280477 2.473093
elementType: C H Ir N
nucrepener: 8607.06316037957004 hartree
cpcmener: -0.02424333507872 hartree
exchangeener: -447.559119953796 hartree
correlationener: -15.133829626052 hartree
xcener: -462.692949579848 hartree
s2: 0.760272
dispersion: -0.138802754 hartree
s2: 0.760607
dispersion: -0.138435840 hartree
s2: 0.761123
dispersion: -0.138064788 hartree
s2: 0.762145
dispersion: -0.137724756 hartree
s2: 0.762691
dispersion: -0.137671570 hartree
s2: 0.762819
dispersion: -0.137631379 hartree
s2: 0.762835
dispersion: -0.137686214 hartree
s2: 0.762774
dispersion: -0.137772216 hartree
s2: 0.762681
dispersion: -0.137879016 hartree
s2: 0.762652
dispersion: -0.137898441 hartree
s2: 0.762718
dispersion: -0.137866208 hartree
s2: 0.762822
dispersion: -0.137848631 hartree
s2: 0.762866
dispersion: -0.137801835 hartree
dispersion: -0.137827893 hartree
s2: 0.762826
dispersion: -0.137815732 hartree
s2: 0.762802
dispersion: -0.137825515 hartree
s2: 0.762796
dispersion: -0.137820880 hartree
s2: 0.762795
dispersion: -0.137822186 hartree
s2: 0.762797
dispersion: -0.137817893 hartree
s2: 0.762798
dispersion: -0.137821572 hartree
dispersion: -0.137817691 hartree
dispersion: -0.137821272 hartree
energy: -76048.8587 -13337.1806 -11628.7598 -11628.7544 -11628.7459 -3134.7673 -2630.8096 -2630.8066 -2630.7816 -2054.6918 -2054.6887 -2054.6798 -2054.6759 -2054.6636 -675.6204 -508.8179 -508.7900 -508.7231 -393.4283 -393.4277 -392.4033 -392.3280 -297.7533 -297.7251 -297.6566 -297.6459 -297.6024 -280.1971 -280.1960 -279.9261 -279.9237 -279.3797 -279.3777 -279.3260 -279.3206 -279.2887 -279.2878 -279.0669 -279.0668 -279.0223 -279.0217 -278.9935 -278.9709 -278.8830 -278.8295 -278.6522 -278.6511 -278.6301 -278.6299 -278.5461 -278.5458 -278.4326 -278.4161 -278.4008 -278.4003 -278.3505 -278.3472 -278.2503 -278.2501 -278.2238 -278.1805 -278.0351 -278.0333 -278.0304 -278.0282 -277.9856 -277.9821 -100.2986 -65.0677 -65.0293 -65.0207 -64.9886 -64.9197 -64.8898 -64.8054 -56.5855 -56.4256 -56.2209 -27.2877 -27.1543 -26.6527 -25.9467 -23.7132 -23.6833 -23.3287 -23.2625 -22.8279 -22.7600 -22.1311 -22.1300 -22.0178 -21.5080 -21.3194 -20.4870 -20.4438 -20.3776 -20.3136 -20.2565 -19.0635 -18.8883 -18.8771 -18.8709 -18.3236 -18.3198 -18.1551 -18.0567 -17.9264 -17.8551 -17.0676 -16.7879 -16.5244 -16.4897 -16.3574 -16.2582 -15.7504 -15.3413 -15.0197 -14.7061 -14.4784 -14.1940 -14.1813 -13.9780 -13.9474 -13.9224 -13.8639 -13.2727 -13.2453 -13.1668 -13.0254 -12.8915 -12.7171 -12.6941 -12.6121 -12.5515 -12.4789 -12.3120 -12.3087 -12.2679 -12.2625 -12.2037 -12.1402 -11.9862 -11.8866 -11.8480 -11.8095 -11.7416 -11.7146 -11.5965 -11.2402 -11.1292 -11.0783 -10.8550 -10.7676 -10.7059 -10.6440 -10.6180 -10.5255 -10.4666 -10.3860 -10.2721 -10.2627 -10.2346 -10.0940 -10.0891 -10.0860 -10.0158 -9.6287 -9.5140 -9.3986 -9.3577 -9.1845 -9.1443 -9.0536 -9.0464 -9.0318 -8.9588 -8.8770 -8.5541 -8.4610 -8.3736 -8.1758 -8.1436 -7.9935 -7.7334 -7.5323 -6.9421 -6.8614 -6.7298 -6.5255 -6.3355 -6.2223 -5.6566 -3.2580 -1.5661 -1.4652 -1.0629 -0.8852 -0.4708 -0.2905 0.2403 0.3268 0.6336 0.8940 0.9357 electronvolt
energy: -76048.8588 -13337.1784 -11628.7591 -11628.7518 -11628.7433 -3134.7665 -2630.8091 -2630.8054 -2630.7806 -2054.6907 -2054.6852 -2054.6787 -2054.6728 -2054.6629 -675.6179 -508.8155 -508.7869 -508.7216 -393.4261 -393.4255 -392.3006 -392.2167 -297.7524 -297.7229 -297.6548 -297.6365 -297.6009 -280.1972 -280.1961 -279.9267 -279.9243 -279.4139 -279.3635 -279.3253 -279.2890 -279.2881 -279.2559 -279.0665 -279.0664 -279.0217 -279.0211 -278.9943 -278.9728 -278.8768 -278.8165 -278.6519 -278.6507 -278.6300 -278.6298 -278.5460 -278.5458 -278.4009 -278.4004 -278.4004 -278.3947 -278.3519 -278.3486 -278.2500 -278.2498 -278.1425 -278.0946 -278.0336 -278.0318 -278.0293 -278.0271 -277.9856 -277.9816 -100.2816 -65.0649 -65.0283 -65.0149 -64.9860 -64.9176 -64.8851 -64.8004 -56.5587 -56.3968 -56.2097 -27.2822 -27.1526 -26.4861 -25.7964 -23.7130 -23.6831 -23.2791 -23.2151 -22.8267 -22.7590 -22.1307 -22.1295 -21.8677 -21.4227 -21.2241 -20.4868 -20.4402 -20.3130 -20.3047 -20.2339 -19.0301 -18.8858 -18.8729 -18.8671 -18.3224 -18.3187 -18.0752 -17.9543 -17.9259 -17.8312 -17.0155 -16.7221 -16.5228 -16.4883 -16.3566 -16.2574 -15.7215 -15.3378 -15.0162 -14.6786 -14.4393 -14.1919 -14.1780 -13.9498 -13.9299 -13.8953 -13.8427 -13.2653 -13.2203 -13.1014 -12.9779 -12.8849 -12.7010 -12.6710 -12.5383 -12.5268 -12.4418 -12.2993 -12.2934 -12.2504 -12.2492 -12.1907 -12.1366 -11.9571 -11.8482 -11.8079 -11.7780 -11.7198 -11.7005 -11.4480 -11.1374 -11.0693 -11.0537 -10.8140 -10.7307 -10.6591 -10.6240 -10.5844 -10.5119 -10.4580 -10.3633 -10.2585 -10.2237 -10.2026 -10.0886 -10.0817 -10.0676 -9.9978 -9.6191 -9.5042 -9.3637 -9.3288 -9.1763 -9.1329 -9.0370 -9.0237 -9.0204 -8.9461 -8.8659 -8.5135 -8.4573 -8.1346 -7.9915 -7.8561 -7.7593 -7.5980 -7.4737 -6.9312 -6.8246 -6.5120 -6.4554 -6.2267 -6.0332 -5.6471 -1.5761 -1.4609 -1.3162 -1.0499 -0.8847 -0.3702 -0.0921 0.2420 0.3390 0.8035 0.9379 electronvolt
chargesum: -0.0000000
charge: 0.021739 0.191875 -0.234809 0.180008 -0.306463 0.112502 0.156626 0.125766 -0.293327 0.127363 0.184169 -0.232607 0.033232 0.193742 0.169123 -0.219503 0.130692 -0.089743 0.105967 -0.119204 0.106672 -0.195909 0.105841 0.010827 0.169951 -0.175624 0.130934 -0.034917 0.138824 -0.116076 0.135431 0.021283 0.231947 0.168260 -0.219363 0.130516 -0.089688 0.105936 -0.119246 0.106669 -0.195822 0.105927 0.010653 0.169984 -0.175715 0.131020 -0.034987 0.138881 -0.115914 0.135405 0.021675 0.232044 -0.350016 -0.315003 -0.307592 -0.270104 -0.270244 0.105480 0.097496 -0.317345 -0.309170 -0.274914 0.131817 0.133807 0.133430 -0.289181 0.128759 0.128637 0.134208 -0.292376 0.136048 0.128468 0.129679 -0.266343 0.131087 0.132588 0.133470 -0.290884 0.129896 0.128110 0.135237 -0.289617 0.134537 0.128362 0.129109
charge: -0.025124 0.154683 -0.207127 -0.017017 -0.151953 0.138954 -0.009667 -0.003492 -0.145230 0.138255 -0.011095 -0.210061 -0.020916 0.155780 0.050848 -0.122210 0.144291 -0.124953 0.133819 -0.164146 0.134090 -0.117265 0.136749 -0.045478 0.079195 -0.124675 0.153216 -0.086476 0.151667 -0.141741 0.154158 -0.004299 0.172455 0.050272 -0.122234 0.144205 -0.124967 0.133810 -0.164086 0.134086 -0.117288 0.136787 -0.045536 0.079208 -0.124718 0.153259 -0.086386 0.151670 -0.141742 0.154148 -0.004176 0.172657 -1.265715 0.043245 0.048970 0.136753 0.136641 0.136509 0.138918 -0.099078 -0.098748 -0.325802 0.124805 0.122940 0.122904 -0.318852 0.122336 0.122077 0.121441 -0.319567 0.121848 0.122259 0.122839 -0.326411 0.125177 0.122940 0.122972 -0.319352 0.122776 0.122128 0.121746 -0.318945 0.121478 0.122126 0.122439
qa: 0.0217 0.1919 -0.2348 0.1800 -0.3065 0.1125 0.1566 0.1258 -0.2933 0.1274 0.1842 -0.2326 0.0332 0.1937 0.1691 -0.2195 0.1307 -0.0897 0.1060 -0.1192 0.1067 -0.1959 0.1058 0.0108 0.1700 -0.1756 0.1309 -0.0349 0.1388 -0.1161 0.1354 0.0213 0.2319 0.1683 -0.2194 0.1305 -0.0897 0.1059 -0.1192 0.1067 -0.1958 0.1059 0.0107 0.1700 -0.1757 0.1310 -0.0350 0.1389 -0.1159 0.1354 0.0217 0.2320 -0.3500 -0.3150 -0.3076 -0.2701 -0.2702 0.1055 0.0975 -0.3173 -0.3092 -0.2749 0.1318 0.1338 0.1334 -0.2892 0.1288 0.1286 0.1342 -0.2924 0.1360 0.1285 0.1297 -0.2663 0.1311 0.1326 0.1335 -0.2909 0.1299 0.1281 0.1352 -0.2896 0.1345 0.1284 0.1291
va: 3.9214 0.9301 3.7964 3.7092 3.8713 0.9839 3.7934 3.8856 3.8384 0.9664 3.6947 3.8255 3.8802 0.9306 3.7785 3.8533 0.9400 3.7362 0.9502 3.7850 0.9504 3.7862 0.9552 3.8318 3.8647 3.8570 0.9562 3.8058 0.9480 3.8124 0.9524 3.8810 0.9157 3.7770 3.8533 0.9400 3.7361 0.9502 3.7851 0.9504 3.7861 0.9552 3.8316 3.8647 3.8572 0.9562 3.8056 0.9480 3.8119 0.9524 3.8805 0.9159 5.4060 3.2753 3.2811 3.3870 3.3867 0.9660 0.9745 4.1696 4.1565 3.8974 0.9545 0.9499 0.9499 3.8345 0.9538 0.9559 0.9607 3.8283 0.9582 0.9547 0.9559 3.8994 0.9539 0.9521 0.9517 3.8275 0.9557 0.9550 0.9585 3.8347 0.9605 0.9561 0.9537
dispersion: -0.137820605 hartree
dipole: -89.157908166 88.105042648 -1.052865519 1.332277029 -1.402716483 -0.070439454 -0.791087746 0.792319350 0.001231604
dipolemethod: SCF
magnitude: 1.055219898 au
magnitude: 2.682155827 debye
temp: 298.15 k
press: 1.00 atm
zeropoint: 0.70758788 hartree
thermalvibcorrection: 0.03705891 hartree
thermalrotcorrection: 0.00141627 hartree
thermaltrasncorrection: 0.00141627 hartree
thermalcorr: 0.03989145 hartree
nonthermalcorr: 0.70758788 hartree
totalcorr: 0.74747933 hartree
thermalcorrenthalpy: 0.00094421 hartree
vibrat: 0.06526628 hartree
rotat: 0.01817059 hartree
transl: 0.02176034 hartree
total: 0.10585166 hartree
totalentropycorr: -0.10585166 hartree
gibbsminuselec: 0.64257188 hartree
