program: Orca
programVersion: 6.0.1
elementType: C C C H C C H C H H N N C H H H C H H H C H C C C C C C H H H H H
keywords: PBE0 D4 DKH2 RIJCOSX DKH-def2-SV(P) def2-tzvp/c Opt Freq CPCM(acetonitrile)
charge: 0
multiplicity: 1
frequency: 0.00 0.00 0.00 0.00 0.00 0.00 15.55 42.46 73.19 106.86 122.95 158.16 162.56 203.45 217.77 256.64 257.56 298.05 327.73 355.44 413.93 457.73 497.66 536.52 562.54 586.45 590.21 612.81 626.68 667.18 719.75 735.31 760.10 777.61 805.00 818.29 842.46 844.84 866.57 898.59 944.93 963.08 1001.59 1011.65 1015.84 1024.88 1048.70 1053.01 1065.81 1102.95 1114.88 1139.61 1149.95 1150.49 1165.27 1172.15 1180.36 1195.15 1231.23 1253.46 1274.53 1320.20 1331.72 1347.65 1388.32 1396.17 1421.28 1440.91 1464.23 1464.69 1471.17 1482.19 1483.16 1493.29 1504.88 1507.24 1521.24 1544.77 1592.58 1675.78 1689.32 1690.54 1691.92 3010.84 3014.47 3018.42 3118.40 3119.17 3165.73 3166.40 3199.09 3204.53 3208.72 3215.65 3216.45 3223.99 3224.17 3230.65 3233.50
frequency: 15.55 42.46 73.19 106.86 122.95 158.16 162.56 203.45 217.77 256.64 257.56 298.05 327.73 355.44 413.93 457.73 497.66 536.52 562.54 586.45 590.21 612.81 626.68 667.18 719.75 735.31 760.10 777.61 805.00 818.29 842.46 844.84 866.57 898.59 944.93 963.08 1001.59 1011.65 1015.84 1024.88 1048.70 1053.01 1065.81 1102.95 1114.88 1139.61 1149.95 1150.49 1165.27 1172.15 1180.36 1195.15 1231.23 1253.46 1274.53 1320.20 1331.72 1347.65 1388.32 1396.17 1421.28 1440.91 1464.23 1464.69 1471.17 1482.19 1483.16 1493.29 1504.88 1507.24 1521.24 1544.77 1592.58 1675.78 1689.32 1690.54 1691.92 3010.84 3014.47 3018.42 3118.40 3119.17 3165.73 3166.40 3199.09 3204.53 3208.72 3215.65 3216.45 3223.99 3224.17 3230.65 3233.50
formula: C15H16N2
InChI: InChI=1/C15H16N2/c1-16-13-10-6-7-11-14(13)17(2)15(16)12-8-4-3-5-9-12/h3-11,15H,1-2H3
33 atoms
C  1.357726 -3.086158 -1.417527
C  2.647735 -3.597125 -1.149034
C  1.053483 -1.809549 -0.972133
H  2.903235 -4.599789 -1.493055
C  3.580017 -2.84647 -0.443133
C  2.004668 -1.043359 -0.253655
H  4.566767 -3.260295 -0.233397
C  3.263423 -1.551067 0.025148
H  3.989963 -0.971781 0.59424
H  0.621842 -3.684815 -1.953568
N  -0.088696 -1.047073 -1.101051
N  1.429238 0.176421 0.037735
C  1.955335 1.095186 1.004692
H  1.833075 0.744646 2.045399
H  3.025123 1.257391 0.818842
H  1.446521 2.062643 0.905935
C  -1.358759 -1.56583 -1.516554
H  -2.033362 -0.73434 -1.758176
H  -1.233456 -2.171397 -2.42369
H  -1.8442 -2.191748 -0.74627
C  -0.002753 0.11218 -0.226284
H  -0.33476 1.022395 -0.758028
C  -0.839868 -0.016303 1.040795
C  -1.731506 0.99454 1.402353
C  -0.709285 -1.140912 1.866859
C  -2.48566 0.893068 2.574648
C  -1.459862 -1.246493 3.036371
C  -2.350078 -0.228125 3.393429
H  -1.836492 1.870364 0.758962
H  -0.018047 -1.93871 1.5920
H  -3.179142 1.689308 2.846665
H  -1.352463 -2.125542 3.672504
H  -2.936958 -0.311991 4.308522
totalener: -689.53956096799789 hartree
nucrepener: 1127.86252646792445 hartree
electener: -1817.38429103376143 hartree
oneelecener: -3171.88386731013406 hartree
twoeener: 1354.49957627637264 hartree
cpcmener: -0.01779433478600 hartree
kineticenergy: 690.80129840634208 hartree
exchangeener: -72.276384834914 hartree
correlationener: -3.994304603002 hartree
xcener: -76.270689437916 hartree
dispersion: -0.037095864 hartree
dispersion: -0.037243572 hartree
dispersion: -0.037720270 hartree
dispersion: -0.038402932 hartree
dispersion: -0.038774780 hartree
dispersion: -0.038690279 hartree
dispersion: -0.039147269 hartree
dispersion: -0.039176264 hartree
dispersion: -0.039235134 hartree
dispersion: -0.039248564 hartree
dispersion: -0.039268737 hartree
dispersion: -0.039325199 hartree
dispersion: -0.039504946 hartree
dispersion: -0.039694946 hartree
dispersion: -0.039640310 hartree
dispersion: -0.039643127 hartree
dispersion: -0.039613620 hartree
dispersion: -0.039582577 hartree
dispersion: -0.039577213 hartree
dispersion: -0.039566201 hartree
elementType: C H N
energy: -392.1072 -392.0988 -280.2646 -279.1981 -279.1855 -278.7701 -278.7628 -278.6049 -278.4663 -278.4596 -278.4588 -278.4503 -278.4447 -278.0477 -278.0457 -277.9793 -277.9708 -27.9567 -25.2439 -23.9597 -23.3102 -21.4214 -20.9387 -20.7946 -20.4918 -19.9498 -18.6611 -17.9808 -16.9947 -16.5118 -16.4885 -16.0464 -14.8049 -14.3821 -14.1582 -13.8130 -13.2746 -12.6768 -12.5855 -12.5660 -12.1973 -12.1901 -12.0206 -11.8954 -11.7494 -11.2540 -10.9058 -10.6910 -10.5756 -10.5373 -10.0037 -9.9890 -9.6929 -9.6122 -8.3166 -8.2599 -7.4349 -7.3759 -6.3279 -4.9058 -0.5064 -0.2366 0.3842 0.6420 1.9821 2.3269 2.5335 2.6608 2.8670 3.2295 3.4426 electronvolt
chargesum: -0.0000000
charge: -0.340086 -0.203081 0.234917 0.165976 -0.203973 0.236862 0.165862 -0.340009 0.165187 0.165097 -0.373927 -0.372975 -0.359642 0.172253 0.201634 0.194741 -0.359801 0.194449 0.201488 0.173251 0.071874 0.181979 0.067689 -0.210017 -0.222995 -0.180998 -0.171916 -0.175792 0.178401 0.191981 0.183559 0.183163 0.184849
charge: -0.216839 -0.189451 0.000480 0.148437 -0.190158 0.000084 0.148390 -0.215943 0.153735 0.153707 -0.086003 -0.086873 -0.304836 0.130849 0.150794 0.150478 -0.304441 0.150830 0.150971 0.130919 0.011849 0.137804 -0.074715 -0.146029 -0.139309 -0.151457 -0.149691 -0.151394 0.156333 0.158068 0.157748 0.157905 0.157761
qa: -0.3401 -0.2031 0.2349 0.1660 -0.2040 0.2369 0.1659 -0.3400 0.1652 0.1651 -0.3739 -0.3730 -0.3596 0.1723 0.2016 0.1947 -0.3598 0.1944 0.2015 0.1733 0.0719 0.1820 0.0677 -0.2100 -0.2230 -0.1810 -0.1719 -0.1758 0.1784 0.1920 0.1836 0.1832 0.1848
va: 3.8079 3.8426 3.8726 0.9374 3.8423 3.8696 0.9374 3.8077 0.9443 0.9443 3.1240 3.1203 3.7918 0.9339 0.9263 0.9341 3.7915 0.9334 0.9265 0.9342 3.8657 0.9439 3.7457 3.8400 3.8623 3.8521 3.8548 3.8500 0.9420 0.9344 0.9331 0.9334 0.9327
dispersion: -0.039569526 hartree
energy: -689.751429319348 hartree
dipole: -2.061577295 0.870131466 -1.191445828 1.288925542 -0.337698450 0.951227092 1.381567892 -0.820089848 0.561478044
dipolemethod: SCF
magnitude: 1.624694967 au
magnitude: 4.129646418 debye
temp: 298.15 k
press: 1.00 atm
zeropoint: 0.28014970 hartree
thermalvibcorrection: 0.01177771 hartree
thermalrotcorrection: 0.00141627 hartree
thermaltrasncorrection: 0.00141627 hartree
thermaltotal: -689.45666937 hartree
thermalcorr: 0.01461025 hartree
nonthermalcorr: 0.28014970 hartree
totalcorr: 0.29475995 hartree
thermalcorrenthalpy: 0.00094421 hartree
totalenthalpy: -689.45572516 hartree
vibrat: 0.02066561 hartree
rotat: 0.01542357 hartree
transl: 0.02001537 hartree
total: 0.05610455 hartree
totalentropycorr: -0.05610455 hartree
gibbsenthalpy: -689.51182971 hartree
gibbsminuselec: 0.23959961 hartree
