program: Orca
programVersion: 6.0.1
elementType: C C C H C C H C H H N N C H H H C H H H C C C C C C C H H H H H
keywords: PBE0 D4 DKH2 RIJCOSX DKH-def2-SV(P) def2-tzvp/c Opt Freq CPCM(acetonitrile)
charge: 0
multiplicity: 2
frequency: 0.00 0.00 0.00 0.00 0.00 0.00 46.06 82.74 96.25 136.58 141.01 173.64 182.80 193.50 276.89 277.31 294.44 301.85 334.20 346.96 435.51 438.08 469.18 545.56 568.84 581.44 590.68 611.36 624.07 647.23 697.44 701.30 736.46 740.43 776.87 822.47 841.59 842.09 848.09 858.98 909.35 978.90 981.43 985.57 985.95 1035.01 1054.06 1055.57 1069.06 1111.47 1131.76 1144.49 1148.55 1156.30 1162.25 1165.63 1180.92 1201.50 1284.39 1291.34 1331.84 1374.59 1389.59 1395.42 1443.99 1455.68 1467.99 1472.82 1482.43 1483.65 1490.18 1499.03 1508.71 1514.11 1532.26 1564.83 1581.54 1610.87 1663.92 1672.18 1690.85 3067.88 3068.22 3155.79 3156.63 3192.07 3192.53 3198.43 3202.79 3212.79 3224.84 3225.98 3231.91 3235.13 3235.44 3239.65
frequency: 46.06 82.74 96.25 136.58 141.01 173.64 182.80 193.50 276.89 277.31 294.44 301.85 334.20 346.96 435.51 438.08 469.18 545.56 568.84 581.44 590.68 611.36 624.07 647.23 697.44 701.30 736.46 740.43 776.87 822.47 841.59 842.09 848.09 858.98 909.35 978.90 981.43 985.57 985.95 1035.01 1054.06 1055.57 1069.06 1111.47 1131.76 1144.49 1148.55 1156.30 1162.25 1165.63 1180.92 1201.50 1284.39 1291.34 1331.84 1374.59 1389.59 1395.42 1443.99 1455.68 1467.99 1472.82 1482.43 1483.65 1490.18 1499.03 1508.71 1514.11 1532.26 1564.83 1581.54 1610.87 1663.92 1672.18 1690.85 3067.88 3068.22 3155.79 3156.63 3192.07 3192.53 3198.43 3202.79 3212.79 3224.84 3225.98 3231.91 3235.13 3235.44 3239.65
formula: C15H15N2
InChI: InChI=1/C15H15N2/c1-16-13-10-6-7-11-14(13)17(2)15(16)12-8-4-3-5-9-12/h3-11H,1-2H3
32 atoms
C  1.448191 -2.68956 -2.185093
C  2.806354 -2.957977 -2.428826
C  1.133456 -1.95721 -1.043879
H  3.082868 -3.529049 -3.315154
C  3.801782 -2.503016 -1.562289
C  2.137979 -1.506142 -0.163898
H  4.847179 -2.723393 -1.778704
C  3.483322 -1.767532 -0.407396
H  4.260508 -1.427411 0.275154
H  0.675467 -3.031486 -2.871759
N  -0.07677 -1.547287 -0.527988
N  1.51335 -0.814187 0.850594
C  2.224369 0.051256 1.759374
H  2.501688 -0.462504 2.690523
H  3.139945 0.40642 1.27045
H  1.604523 0.919832 2.004675
C  -1.340892 -2.075948 -0.97902
H  -2.025217 -2.171628 -0.129575
H  -1.808259 -1.439268 -1.74322
H  -1.178078 -3.07263 -1.406989
C  0.137535 -0.832409 0.645981
C  -0.850444 -0.240789 1.471496
C  -2.086521 0.247996 0.937149
C  -0.664992 -0.098712 2.884944
C  -3.045751 0.825001 1.754113
C  -1.635337 0.485925 3.683114
C  -2.841522 0.957794 3.138089
H  -2.262471 0.211504 -0.136519
H  0.232775 -0.497806 3.354016
H  -3.96712 1.197884 1.30325
H  -1.45921 0.560978 4.757591
H  -3.600137 1.41437 3.773033
totalener: -688.91773017287005 hartree
nucrepener: 1106.53442521429270 hartree
electener: -1795.43375753722239 hartree
oneelecener: -3128.63718970271475 hartree
twoeener: 1333.20343216549236 hartree
cpcmener: -0.01837768694336 hartree
kineticenergy: 689.87978828209907 hartree
exchangeener: -71.935065901900 hartree
correlationener: -3.952743013268 hartree
xcener: -75.887808915168 hartree
s2: 0.763245
dispersion: -0.036022188 hartree
s2: 0.761827
dispersion: -0.036428978 hartree
s2: 0.761629
dispersion: -0.037026278 hartree
s2: 0.762361
dispersion: -0.037630074 hartree
s2: 0.763181
dispersion: -0.037759314 hartree
s2: 0.763424
dispersion: -0.037537424 hartree
s2: 0.765372
dispersion: -0.037708504 hartree
s2: 0.766512
dispersion: -0.037515030 hartree
s2: 0.769004
dispersion: -0.037504436 hartree
s2: 0.770694
dispersion: -0.037526304 hartree
s2: 0.771450
dispersion: -0.037505567 hartree
s2: 0.771321
dispersion: -0.037488103 hartree
s2: 0.771165
dispersion: -0.037499925 hartree
s2: 0.771345
dispersion: -0.037522056 hartree
s2: 0.771373
dispersion: -0.037537746 hartree
s2: 0.771551
dispersion: -0.037552513 hartree
s2: 0.771751
dispersion: -0.037561783 hartree
s2: 0.771909
dispersion: -0.037545958 hartree
s2: 0.772120
dispersion: -0.037540436 hartree
s2: 0.772242
dispersion: -0.037528883 hartree
s2: 0.772513
dispersion: -0.037540578 hartree
s2: 0.772588
dispersion: -0.037548755 hartree
s2: 0.772734
dispersion: -0.037560807 hartree
s2: 0.772737
dispersion: -0.037564739 hartree
s2: 0.772707
dispersion: -0.037563575 hartree
s2: 0.772700
dispersion: -0.037562439 hartree
s2: 0.772699
dispersion: -0.037561705 hartree
elementType: C H N
s2: 0.772697
energy: -393.1181 -393.1142 -280.2888 -279.5075 -279.5000 -279.0256 -279.0241 -278.6061 -278.3536 -278.3515 -278.2498 -278.2428 -278.1643 -278.1635 -278.1192 -278.1177 -277.9385 -28.8364 -25.9887 -23.8803 -23.4047 -21.5878 -21.3305 -20.8594 -20.5066 -20.0410 -19.1259 -18.0864 -17.2981 -16.5469 -16.4158 -16.2155 -14.8359 -14.5856 -14.4587 -13.9238 -13.3745 -13.0326 -12.6925 -12.5671 -12.4462 -12.4006 -12.2959 -11.7191 -11.6671 -11.2218 -11.1794 -11.1274 -10.4739 -10.3249 -9.9428 -9.8353 -9.7962 -9.2894 -8.7862 -7.8864 -7.3136 -6.8653 -6.5347 -3.2173 -0.1574 0.0348 0.3174 1.0454 2.0323 2.3551 2.4534 2.8534 3.2287 3.3691 3.5331 electronvolt
energy: -393.0547 -393.0508 -280.1280 -279.5230 -279.5154 -279.0292 -279.0276 -278.6243 -278.3241 -278.3220 -278.2408 -278.2340 -278.1650 -278.1638 -278.0786 -278.0774 -277.8237 -28.7119 -25.8691 -23.7968 -23.3288 -21.5018 -21.2215 -20.8047 -20.4155 -19.9590 -19.1011 -17.8798 -17.2717 -16.4789 -16.3728 -16.1539 -14.7985 -14.5302 -14.4158 -13.6708 -13.2646 -12.9857 -12.6317 -12.5148 -12.4248 -12.3691 -12.2424 -11.6777 -11.6402 -11.2018 -11.1484 -11.0626 -10.3204 -10.1978 -9.9288 -9.7732 -9.5336 -9.2358 -8.5723 -7.4882 -7.0431 -6.5748 -6.1917 -1.1997 0.1691 0.1984 0.3609 1.6938 2.0567 2.3708 2.4699 2.8682 3.2552 3.4100 electronvolt
chargesum: -0.0000000
charge: -0.311832 -0.195026 0.218337 0.176604 -0.195623 0.219756 0.176637 -0.312103 0.178475 0.178499 -0.339466 -0.339521 -0.379090 0.209183 0.209960 0.218033 -0.378644 0.217623 0.209419 0.210162 0.287131 -0.030381 -0.241637 -0.242211 -0.185222 -0.184877 -0.223494 0.171628 0.172210 0.169987 0.169875 0.165606
charge: -0.199069 -0.173858 0.003017 0.154268 -0.173983 0.002974 0.154239 -0.199097 0.160810 0.160800 -0.006856 -0.006856 -0.296810 0.150563 0.155878 0.159690 -0.296675 0.159542 0.150557 0.156093 0.035868 -0.108934 -0.176678 -0.176842 -0.163228 -0.163149 -0.213062 0.150910 0.150998 0.150623 0.150614 0.147652
qa: -0.3118 -0.1950 0.2183 0.1766 -0.1956 0.2198 0.1766 -0.3121 0.1785 0.1785 -0.3395 -0.3395 -0.3791 0.2092 0.2100 0.2180 -0.3786 0.2176 0.2094 0.2102 0.2871 -0.0304 -0.2416 -0.2422 -0.1852 -0.1849 -0.2235 0.1716 0.1722 0.1700 0.1699 0.1656
va: 3.8113 3.8504 3.8750 0.9353 3.8508 3.8739 0.9353 3.8115 0.9409 0.9409 3.2632 3.2625 3.7572 0.9187 0.9302 0.9289 3.7576 0.9288 0.9186 0.9304 3.7622 3.8881 3.8385 3.8384 3.8696 3.8692 3.8356 0.9383 0.9379 0.9351 0.9352 0.9380
dispersion: -0.037561891 hartree
energy: -689.130932766227 hartree
dipole: -1.290082664 1.793752693 0.503670029 0.792052598 -1.093127821 -0.301075223 1.069986311 -1.496476824 -0.426490513
dipolemethod: SCF
magnitude: 0.725412948 au
magnitude: 1.843853180 debye
temp: 298.15 k
press: 1.00 atm
zeropoint: 0.26828150 hartree
thermalvibcorrection: 0.01135589 hartree
thermalrotcorrection: 0.00141627 hartree
thermaltrasncorrection: 0.00141627 hartree
thermaltotal: -688.84846284 hartree
thermalcorr: 0.01418843 hartree
nonthermalcorr: 0.26828150 hartree
totalcorr: 0.28246993 hartree
thermalcorrenthalpy: 0.00094421 hartree
totalenthalpy: -688.84751863 hartree
vibrat: 0.01922252 hartree
rotat: 0.01547762 hartree
transl: 0.02000899 hartree
total: 0.05536359 hartree
totalentropycorr: -0.05536359 hartree
gibbsenthalpy: -688.90288222 hartree
gibbsminuselec: 0.22805055 hartree
