program: Orca
programVersion: 6.0.1
elementType: C C C H C C H C H H N N C H H H C H H H C H C C C C C C H H H H H
keywords: PBE0 D4 DKH2 RIJCOSX DKH-def2-SV(P) def2-tzvp/c Opt Freq CPCM(acetonitrile)
charge: 1
multiplicity: 2
frequency: 0.00 0.00 0.00 0.00 0.00 0.00 29.91 37.04 44.75 58.11 72.13 125.44 134.99 204.59 231.37 255.53 258.64 302.58 316.32 346.21 416.15 479.84 492.36 533.29 538.12 555.38 600.30 622.76 626.75 661.99 718.29 755.08 772.42 775.98 802.99 824.90 849.21 855.92 863.94 950.69 963.22 1004.55 1008.28 1015.45 1017.71 1031.63 1036.09 1042.13 1064.94 1114.51 1116.58 1135.96 1140.34 1163.29 1164.57 1175.78 1190.89 1197.97 1239.17 1245.32 1268.45 1296.34 1310.38 1355.77 1373.32 1412.18 1446.09 1447.72 1452.90 1461.78 1464.35 1474.58 1476.23 1484.46 1492.44 1505.40 1547.88 1593.19 1600.30 1653.08 1670.24 1678.88 1691.73 3028.48 3074.41 3076.35 3171.30 3172.65 3208.84 3211.88 3212.41 3217.05 3223.65 3232.91 3234.67 3240.52 3244.09 3254.00 3257.22
frequency: 29.91 37.04 44.75 58.11 72.13 125.44 134.99 204.59 231.37 255.53 258.64 302.58 316.32 346.21 416.15 479.84 492.36 533.29 538.12 555.38 600.30 622.76 626.75 661.99 718.29 755.08 772.42 775.98 802.99 824.90 849.21 855.92 863.94 950.69 963.22 1004.55 1008.28 1015.45 1017.71 1031.63 1036.09 1042.13 1064.94 1114.51 1116.58 1135.96 1140.34 1163.29 1164.57 1175.78 1190.89 1197.97 1239.17 1245.32 1268.45 1296.34 1310.38 1355.77 1373.32 1412.18 1446.09 1447.72 1452.90 1461.78 1464.35 1474.58 1476.23 1484.46 1492.44 1505.40 1547.88 1593.19 1600.30 1653.08 1670.24 1678.88 1691.73 3028.48 3074.41 3076.35 3171.30 3172.65 3208.84 3211.88 3212.41 3217.05 3223.65 3232.91 3234.67 3240.52 3244.09 3254.00 3257.22
formula: C15H16N2
InChI: InChI=1/C15H16N2/c1-16-13-10-6-7-11-14(13)17(2)15(16)12-8-4-3-5-9-12/h3-11,15H,1-2H3
33 atoms
C  1.410797 -3.1221 -1.549038
C  2.727326 -3.539445 -1.462864
C  1.075335 -1.918232 -0.907321
H  3.024674 -4.467781 -1.948878
C  3.706309 -2.790164 -0.757447
C  2.061378 -1.169073 -0.181788
H  4.729889 -3.161112 -0.724472
C  3.394604 -1.605449 -0.11356
H  4.14897 -1.034221 0.422983
H  0.665609 -3.701961 -2.089092
N  -0.090077 -1.257535 -0.824801
N  1.458312 -0.09294 0.348873
C  2.075398 0.972269 1.096694
H  2.942566 0.585777 1.641365
H  2.397253 1.782194 0.426395
H  1.353573 1.370105 1.819019
C  -1.36492 -1.653389 -1.365858
H  -1.908092 -0.762928 -1.702972
H  -1.209122 -2.317291 -2.22151
H  -1.965759 -2.173308 -0.606322
C  0.055341 -0.055154 -0.023417
H  -0.135958 0.828984 -0.659016
C  -0.877143 -0.022034 1.170013
C  -1.821268 0.997939 1.291132
C  -0.794186 -1.023202 2.144599
C  -2.686294 1.020291 2.387592
C  -1.657452 -0.998996 3.237222
C  -2.60445 0.023095 3.359318
H  -1.880514 1.774935 0.528232
H  -0.055454 -1.820723 2.051814
H  -3.422499 1.818522 2.480299
H  -1.592596 -1.777995 3.996678
H  -3.278744 0.040192 4.215671
totalener: -689.36539451065141 hartree
nucrepener: 1127.86252646792445 hartree
electener: -1817.15356256445534 hartree
oneelecener: -3152.68565944028978 hartree
twoeener: 1335.53209687583444 hartree
cpcmener: -0.07435536799990 hartree
kineticenergy: 690.58348197969190 hartree
exchangeener: -72.048756003863 hartree
correlationener: -3.951394565369 hartree
xcener: -76.000150569232 hartree
s2: 0.765171
dispersion: -0.035470212 hartree
s2: 0.763329
dispersion: -0.035645163 hartree
s2: 0.761539
dispersion: -0.036130009 hartree
s2: 0.759906
dispersion: -0.036792399 hartree
s2: 0.759238
dispersion: -0.037138872 hartree
s2: 0.759426
dispersion: -0.037049027 hartree
s2: 0.759462
dispersion: -0.037445915 hartree
s2: 0.759464
dispersion: -0.037298645 hartree
s2: 0.759417
dispersion: -0.037250773 hartree
s2: 0.759401
dispersion: -0.037240077 hartree
s2: 0.759410
dispersion: -0.037228598 hartree
s2: 0.759407
dispersion: -0.037226698 hartree
s2: 0.759408
dispersion: -0.037220321 hartree
dispersion: -0.037213832 hartree
dispersion: -0.037207593 hartree
s2: 0.759406
dispersion: -0.037199162 hartree
dispersion: -0.037180965 hartree
s2: 0.759411
dispersion: -0.037180502 hartree
s2: 0.759420
dispersion: -0.037181099 hartree
s2: 0.759423
dispersion: -0.037177885 hartree
s2: 0.759424
dispersion: -0.037176178 hartree
s2: 0.759421
dispersion: -0.037182796 hartree
s2: 0.759419
dispersion: -0.037187478 hartree
dispersion: -0.037192212 hartree
dispersion: -0.037194646 hartree
dispersion: -0.037197245 hartree
s2: 0.759416
dispersion: -0.037197697 hartree
dispersion: -0.037198651 hartree
dispersion: -0.037196409 hartree
dispersion: -0.037193931 hartree
elementType: C H N
energy: -394.1673 -394.1514 -281.3930 -280.7871 -280.7785 -279.4856 -279.4707 -279.3080 -279.2146 -279.2101 -279.1456 -279.1388 -278.8685 -278.8641 -278.7466 -278.7387 -278.7213 -29.7835 -27.0119 -24.7920 -24.2414 -22.4483 -22.0571 -21.7814 -21.1617 -20.7714 -19.9488 -18.9960 -17.8396 -17.4500 -17.2409 -16.9996 -15.4801 -15.4659 -15.4312 -15.0560 -13.9739 -13.7102 -13.4314 -13.3256 -13.2238 -13.1560 -13.0400 -12.5382 -12.2358 -12.0582 -11.8265 -11.7516 -11.5875 -11.1576 -10.8671 -10.6777 -10.3671 -10.0951 -9.9042 -9.5701 -7.9083 -7.7425 -7.5729 -6.1502 -0.9598 -0.7233 -0.6597 -0.4653 1.7305 2.0301 2.2682 2.3073 2.5792 2.7612 3.0972 electronvolt
energy: -393.9914 -393.9789 -281.4146 -280.7465 -280.7366 -279.4950 -279.4798 -279.2728 -279.1647 -279.1608 -279.1441 -279.1392 -278.8708 -278.8654 -278.7476 -278.7379 -278.7199 -29.5425 -26.7116 -24.6751 -24.1805 -22.3534 -21.9859 -21.7052 -21.1586 -20.6871 -19.9009 -18.8527 -17.7343 -17.4176 -17.1535 -16.9386 -15.3776 -15.3732 -15.2743 -14.8761 -13.8781 -13.6181 -13.2594 -13.1543 -13.1281 -13.0971 -12.9639 -12.4813 -12.2286 -11.9815 -11.7223 -11.5839 -11.4712 -11.1281 -10.8528 -10.6317 -10.3114 -10.0799 -9.3880 -9.0010 -7.8305 -7.7343 -7.1649 -3.9148 -0.8900 -0.5836 -0.2428 -0.0387 1.7656 2.0543 2.2865 2.3356 2.6185 2.7983 electronvolt
chargesum: 1.0000000
charge: -0.238766 -0.159178 0.239121 0.209937 -0.158203 0.241474 0.209934 -0.240248 0.208713 0.208942 -0.317241 -0.320006 -0.363174 0.231741 0.224198 0.227227 -0.361403 0.225606 0.234217 0.224563 0.106908 0.252727 0.017264 -0.177653 -0.192188 -0.178133 -0.171133 -0.162853 0.194532 0.201114 0.193760 0.193841 0.194361
charge: -0.163161 -0.114472 0.045128 0.172952 -0.114011 0.045328 0.172974 -0.163443 0.178083 0.178029 0.032574 0.030579 -0.291716 0.170371 0.166893 0.167386 -0.292259 0.169846 0.171269 0.165571 0.024314 0.184541 -0.076744 -0.131147 -0.130021 -0.143129 -0.141044 -0.135251 0.165823 0.164305 0.163640 0.163632 0.163160
qa: -0.2388 -0.1592 0.2391 0.2099 -0.1582 0.2415 0.2099 -0.2402 0.2087 0.2089 -0.3172 -0.3200 -0.3632 0.2317 0.2242 0.2272 -0.3614 0.2256 0.2342 0.2246 0.1069 0.2527 0.0173 -0.1777 -0.1922 -0.1781 -0.1711 -0.1629 0.1945 0.2011 0.1938 0.1938 0.1944
va: 3.8306 3.8505 3.8578 0.9272 3.8494 3.8550 0.9272 3.8308 0.9342 0.9345 3.3379 3.3372 3.7205 0.9234 0.9202 0.9276 3.7186 0.9269 0.9235 0.9225 3.7859 0.9240 3.8249 3.8364 3.8400 3.8606 3.8700 3.8507 0.9368 0.9286 0.9308 0.9307 0.9305
dispersion: -0.037194826 hartree
energy: -689.589074412947 hartree
dipole: -1.736568745 2.303219646 0.566650902 1.898246522 -1.635456015 0.262790507 0.390552066 -1.426647151 -1.036095085
dipolemethod: SCF
magnitude: 1.209812018 au
magnitude: 3.075097769 debye
temp: 298.15 k
press: 1.00 atm
zeropoint: 0.28112701 hartree
thermalvibcorrection: 0.01209033 hartree
thermalrotcorrection: 0.00141627 hartree
thermaltrasncorrection: 0.00141627 hartree
thermaltotal: -689.29302454 hartree
thermalcorr: 0.01492287 hartree
nonthermalcorr: 0.28112701 hartree
totalcorr: 0.29604988 hartree
thermalcorrenthalpy: 0.00094421 hartree
totalenthalpy: -689.29208033 hartree
vibrat: 0.02125259 hartree
rotat: 0.01545241 hartree
transl: 0.02001537 hartree
total: 0.05737483 hartree
totalentropycorr: -0.05737483 hartree
gibbsenthalpy: -689.34945516 hartree
gibbsminuselec: 0.23961925 hartree
