program: Orca
programVersion: 6.0.1
elementType: C C C H C C H C H H N N C H H H C H H H C C C C C C C H H H H H
keywords: PBE0 D4 DKH2 RIJCOSX DKH-def2-SV(P) def2-tzvp/c Opt Freq CPCM(acetonitrile)
charge: 1
multiplicity: 1
frequency: 0.00 0.00 0.00 0.00 0.00 0.00 50.45 57.60 79.27 127.89 135.45 157.87 165.74 200.97 263.16 268.36 290.25 322.36 331.36 386.50 414.85 461.09 503.87 552.48 577.30 595.16 623.99 629.04 643.33 713.87 717.58 739.88 768.00 791.42 798.00 847.05 852.73 868.56 880.77 962.86 971.04 1009.51 1016.76 1018.43 1035.74 1050.39 1058.46 1058.87 1101.55 1118.63 1147.81 1153.23 1157.53 1163.81 1165.48 1178.26 1190.49 1203.67 1300.00 1315.70 1350.73 1382.95 1401.66 1420.69 1449.37 1449.60 1462.68 1479.75 1481.69 1487.53 1488.90 1494.61 1527.30 1544.57 1551.24 1597.79 1625.76 1667.14 1694.99 1698.54 1712.38 3100.72 3101.32 3200.40 3201.36 3222.48 3227.52 3229.32 3229.60 3230.37 3232.55 3240.50 3240.61 3246.19 3251.13 3254.05
frequency: 50.45 57.60 79.27 127.89 135.45 157.87 165.74 200.97 263.16 268.36 290.25 322.36 331.36 386.50 414.85 461.09 503.87 552.48 577.30 595.16 623.99 629.04 643.33 713.87 717.58 739.88 768.00 791.42 798.00 847.05 852.73 868.56 880.77 962.86 971.04 1009.51 1016.76 1018.43 1035.74 1050.39 1058.46 1058.87 1101.55 1118.63 1147.81 1153.23 1157.53 1163.81 1165.48 1178.26 1190.49 1203.67 1300.00 1315.70 1350.73 1382.95 1401.66 1420.69 1449.37 1449.60 1462.68 1479.75 1481.69 1487.53 1488.90 1494.61 1527.30 1544.57 1551.24 1597.79 1625.76 1667.14 1694.99 1698.54 1712.38 3100.72 3101.32 3200.40 3201.36 3222.48 3227.52 3229.32 3229.60 3230.37 3232.55 3240.50 3240.61 3246.19 3251.13 3254.05
formula: C15H15N2
InChI: InChI=1/C15H15N2/c1-16-13-10-6-7-11-14(13)17(2)15(16)12-8-4-3-5-9-12/h3-11H,1-2H3
32 atoms
C  1.442227 -2.884047 -2.048429
C  2.790186 -3.036841 -2.354153
C  1.138258 -2.050226 -0.971705
H  3.075928 -3.677526 -3.187541
C  3.796105 -2.382572 -1.615141
C  2.138547 -1.400263 -0.236422
H  4.839324 -2.532293 -1.890771
C  3.491474 -1.55195 -0.542228
H  4.268815 -1.050139 0.030656
H  0.66544 -3.385627 -2.622227
N  -0.069545 -1.687743 -0.403128
N  1.494732 -0.660433 0.739294
C  2.168312 0.20956 1.684335
H  2.627263 -0.383941 2.483647
H  2.942723 0.773569 1.153989
H  1.447108 0.909483 2.113437
C  -1.360134 -2.192018 -0.831979
H  -2.095629 -2.030797 -0.040008
H  -1.682378 -1.678649 -1.745431
H  -1.272096 -3.266229 -1.025275
C  0.170656 -0.851439 0.619975
C  -0.851515 -0.242297 1.471647
C  -1.885158 0.510042 0.894363
C  -0.795357 -0.413059 2.862743
C  -2.855133 1.088883 1.709189
C  -1.772795 0.165324 3.668996
C  -2.800589 0.916068 3.094016
H  -1.918352 0.655052 -0.185067
H  -0.000644 -1.010324 3.308714
H  -3.653544 1.679207 1.260861
H  -1.732968 0.025526 4.748719
H  -3.562694 1.368715 3.728166
totalener: -688.74255152645094 hartree
nucrepener: 1106.53442521429270 hartree
electener: -1795.20423020977387 hartree
oneelecener: -3109.52147770487045 hartree
twoeener: 1314.31724749509658 hartree
cpcmener: -0.07272504617205 hartree
kineticenergy: 689.49328181442490 hartree
exchangeener: -71.678491258059 hartree
correlationener: -3.913944128742 hartree
xcener: -75.592435386801 hartree
dispersion: -0.034443078 hartree
dispersion: -0.034889199 hartree
dispersion: -0.035483075 hartree
dispersion: -0.036076552 hartree
dispersion: -0.036331377 hartree
dispersion: -0.036208202 hartree
dispersion: -0.035992765 hartree
dispersion: -0.036127818 hartree
dispersion: -0.035936501 hartree
dispersion: -0.035901721 hartree
dispersion: -0.036018909 hartree
dispersion: -0.035976439 hartree
dispersion: -0.035967976 hartree
dispersion: -0.035970897 hartree
dispersion: -0.035994142 hartree
dispersion: -0.036034616 hartree
dispersion: -0.036056969 hartree
dispersion: -0.036066580 hartree
dispersion: -0.036063106 hartree
dispersion: -0.036060798 hartree
dispersion: -0.036059526 hartree
elementType: C H N
energy: -394.5672 -394.5639 -282.0061 -280.3021 -280.2942 -279.6831 -279.5935 -279.5928 -279.1447 -279.1433 -279.1353 -279.1329 -278.9393 -278.9343 -278.9341 -278.8813 -278.8804 -30.3854 -27.1592 -24.8676 -24.3394 -22.5031 -22.2212 -21.6645 -21.3596 -20.9896 -19.9278 -18.8247 -18.4033 -17.4676 -17.2986 -16.9475 -15.6488 -15.4930 -15.2247 -14.9077 -13.9527 -13.8926 -13.3568 -13.3371 -13.2132 -13.1564 -13.0933 -12.5697 -12.4343 -11.9016 -11.8652 -11.8189 -11.1516 -10.9734 -10.6032 -10.5957 -10.4984 -10.2202 -9.5386 -8.2655 -7.9040 -7.5223 -7.4292 -1.9488 -0.7407 -0.7274 -0.3411 0.2714 1.6831 2.0102 2.2095 2.5005 2.9922 3.0759 electronvolt
chargesum: 1.0000000
charge: -0.240610 -0.173117 0.210921 0.202010 -0.172805 0.210761 0.201959 -0.240482 0.205343 0.205302 -0.290010 -0.290627 -0.374278 0.234797 0.234690 0.244126 -0.374426 0.244011 0.234744 0.234851 0.378658 -0.102919 -0.156072 -0.156523 -0.167017 -0.167247 -0.153725 0.207655 0.207823 0.200574 0.200565 0.201070
charge: -0.145121 -0.135748 0.010043 0.168376 -0.135720 0.010029 0.168352 -0.145148 0.176842 0.176830 0.064598 0.064492 -0.288440 0.170965 0.172197 0.172711 -0.288413 0.172740 0.170919 0.172185 0.131205 -0.082330 -0.115600 -0.115700 -0.137306 -0.137328 -0.121558 0.171572 0.171565 0.167841 0.167824 0.167124
qa: -0.2406 -0.1731 0.2109 0.2020 -0.1728 0.2108 0.2020 -0.2405 0.2053 0.2053 -0.2900 -0.2906 -0.3743 0.2348 0.2347 0.2441 -0.3744 0.2440 0.2347 0.2349 0.3787 -0.1029 -0.1561 -0.1565 -0.1670 -0.1672 -0.1537 0.2077 0.2078 0.2006 0.2006 0.2011
va: 3.8230 3.8517 3.8656 0.9294 3.8519 3.8656 0.9294 3.8230 0.9340 0.9340 3.3926 3.3922 3.6995 0.9165 0.9203 0.9194 3.6995 0.9194 0.9166 0.9202 3.7741 3.9254 3.8493 3.8497 3.8589 3.8591 3.8506 0.9286 0.9285 0.9288 0.9289 0.9287
dispersion: -0.036060177 hartree
energy: -689.033158320921 hartree
dipole: -1.445664991 1.425402412 -0.020262580 0.856088877 -0.844910261 0.011178617 1.207240951 -1.190131001 0.017109950
dipolemethod: SCF
magnitude: 0.028779923 au
magnitude: 0.073152752 debye
temp: 298.15 k
press: 1.00 atm
zeropoint: 0.27195035 hartree
thermalvibcorrection: 0.01121030 hartree
thermalrotcorrection: 0.00141627 hartree
thermaltrasncorrection: 0.00141627 hartree
thermaltotal: -688.74716513 hartree
thermalcorr: 0.01404285 hartree
nonthermalcorr: 0.27195035 hartree
totalcorr: 0.28599319 hartree
thermalcorrenthalpy: 0.00094421 hartree
totalenthalpy: -688.74622092 hartree
vibrat: 0.01915195 hartree
rotat: 0.01545960 hartree
transl: 0.02000899 hartree
total: 0.05462055 hartree
totalentropycorr: -0.05462055 hartree
gibbsenthalpy: -688.80084147 hartree
gibbsminuselec: 0.23231685 hartree
