program: Orca
programVersion: 5.0.4
elementType: Fe P P P N C C H C H C C H C C H H H C C H C H C C H C C H H H C C H C H C C H C C H H H C H C H H H C H H H C H C H H H C H H H C H C H H H C H H H C H C H H H C H H H C H C H H H C H H H C H C H H H C H H H C O O
keywords: PBE0 D4 DKH2 RIJCOSX DKH-def2-SV(P) def2-tzvp/c Opt Freq UNO UCO NormalPrint CPCM(acetonitrile)
charge: 2
multiplicity: 5
frequency: 0.00 0.00 0.00 0.00 0.00 0.00 13.38 15.07 26.46 28.80 31.14 33.20 38.05 40.60 45.83 49.71 56.91 63.47 72.03 78.14 78.63 81.91 86.65 89.75 93.10 96.73 100.85 103.50 107.38 109.39 111.85 116.67 118.53 124.38 131.28 143.13 144.62 147.83 151.39 155.75 159.29 170.96 175.38 186.37 195.67 202.11 204.79 213.82 214.87 221.25 227.10 230.77 232.25 240.29 243.54 247.16 250.56 254.31 255.80 260.56 262.63 265.01 267.33 271.66 275.70 280.77 295.48 298.24 308.39 319.72 325.90 337.33 346.37 352.04 362.22 366.49 371.22 381.94 385.97 390.20 401.68 407.54 415.40 425.44 445.50 450.04 469.67 474.70 476.30 487.30 490.77 495.03 501.59 510.27 527.28 543.33 550.02 559.23 587.06 588.12 593.33 615.42 626.08 632.24 648.67 654.94 670.89 685.63 690.87 698.42 700.99 702.15 708.84 769.06 771.31 776.45 838.17 841.87 857.89 883.01 884.48 909.67 912.89 917.39 919.21 921.33 922.80 923.93 925.09 927.09 930.05 943.14 943.43 947.18 947.44 950.14 950.31 953.07 959.47 983.11 984.20 984.82 985.71 989.17 990.25 998.95 999.73 1000.19 1026.23 1026.28 1026.40 1051.64 1051.94 1053.19 1065.41 1065.97 1066.40 1073.16 1074.91 1083.68 1087.79 1103.19 1103.82 1142.19 1147.74 1148.77 1149.68 1153.78 1154.20 1179.63 1180.78 1182.24 1191.17 1193.80 1194.03 1195.29 1195.83 1196.91 1221.73 1255.12 1256.80 1266.22 1282.57 1283.44 1285.30 1286.00 1288.88 1295.67 1296.51 1310.87 1313.61 1317.74 1318.43 1333.33 1336.43 1341.20 1342.37 1349.17 1350.21 1378.42 1390.99 1391.24 1406.46 1407.32 1408.41 1409.72 1411.60 1412.30 1413.53 1413.87 1414.32 1418.03 1420.92 1422.51 1426.25 1427.22 1428.67 1430.72 1441.07 1441.42 1442.27 1473.40 1473.69 1474.59 1474.91 1477.06 1477.60 1478.33 1480.42 1481.33 1482.89 1483.45 1484.55 1484.99 1486.01 1486.29 1487.82 1488.51 1490.05 1490.69 1491.84 1493.89 1494.00 1497.09 1497.65 1500.75 1500.98 1504.77 1508.96 1511.12 1519.21 1538.51 1539.50 1547.25 1648.62 1653.63 1654.54 1687.07 1687.63 1690.20 2499.09 3057.86 3058.07 3059.87 3059.93 3061.19 3063.36 3065.60 3066.20 3067.65 3068.10 3072.28 3073.07 3075.26 3077.24 3079.63 3091.20 3093.88 3096.31 3106.98 3122.08 3128.29 3143.02 3143.45 3143.47 3143.53 3146.07 3146.83 3150.13 3151.57 3152.22 3152.33 3157.85 3159.48 3159.66 3159.86 3162.60 3163.97 3169.46 3171.35 3171.52 3172.66 3174.98 3175.74 3178.03 3178.33 3181.10 3182.33 3184.36 3189.43 3190.96 3213.72 3221.01 3221.25 3221.77 3225.69 3228.07 3240.40 3243.29 3243.73 3254.12
frequency: 13.38 15.07 26.46 28.80 31.14 33.20 38.05 40.60 45.83 49.71 56.91 63.47 72.03 78.14 78.63 81.91 86.65 89.75 93.10 96.73 100.85 103.50 107.38 109.39 111.85 116.67 118.53 124.38 131.28 143.13 144.62 147.83 151.39 155.75 159.29 170.96 175.38 186.37 195.67 202.11 204.79 213.82 214.87 221.25 227.10 230.77 232.25 240.29 243.54 247.16 250.56 254.31 255.80 260.56 262.63 265.01 267.33 271.66 275.70 280.77 295.48 298.24 308.39 319.72 325.90 337.33 346.37 352.04 362.22 366.49 371.22 381.94 385.97 390.20 401.68 407.54 415.40 425.44 445.50 450.04 469.67 474.70 476.30 487.30 490.77 495.03 501.59 510.27 527.28 543.33 550.02 559.23 587.06 588.12 593.33 615.42 626.08 632.24 648.67 654.94 670.89 685.63 690.87 698.42 700.99 702.15 708.84 769.06 771.31 776.45 838.17 841.87 857.89 883.01 884.48 909.67 912.89 917.39 919.21 921.33 922.80 923.93 925.09 927.09 930.05 943.14 943.43 947.18 947.44 950.14 950.31 953.07 959.47 983.11 984.20 984.82 985.71 989.17 990.25 998.95 999.73 1000.19 1026.23 1026.28 1026.40 1051.64 1051.94 1053.19 1065.41 1065.97 1066.40 1073.16 1074.91 1083.68 1087.79 1103.19 1103.82 1142.19 1147.74 1148.77 1149.68 1153.78 1154.20 1179.63 1180.78 1182.24 1191.17 1193.80 1194.03 1195.29 1195.83 1196.91 1221.73 1255.12 1256.80 1266.22 1282.57 1283.44 1285.30 1286.00 1288.88 1295.67 1296.51 1310.87 1313.61 1317.74 1318.43 1333.33 1336.43 1341.20 1342.37 1349.17 1350.21 1378.42 1390.99 1391.24 1406.46 1407.32 1408.41 1409.72 1411.60 1412.30 1413.53 1413.87 1414.32 1418.03 1420.92 1422.51 1426.25 1427.22 1428.67 1430.72 1441.07 1441.42 1442.27 1473.40 1473.69 1474.59 1474.91 1477.06 1477.60 1478.33 1480.42 1481.33 1482.89 1483.45 1484.55 1484.99 1486.01 1486.29 1487.82 1488.51 1490.05 1490.69 1491.84 1493.89 1494.00 1497.09 1497.65 1500.75 1500.98 1504.77 1508.96 1511.12 1519.21 1538.51 1539.50 1547.25 1648.62 1653.63 1654.54 1687.07 1687.63 1690.20 2499.09 3057.86 3058.07 3059.87 3059.93 3061.19 3063.36 3065.60 3066.20 3067.65 3068.10 3072.28 3073.07 3075.26 3077.24 3079.63 3091.20 3093.88 3096.31 3106.98 3122.08 3128.29 3143.02 3143.45 3143.47 3143.53 3146.07 3146.83 3150.13 3151.57 3152.22 3152.33 3157.85 3159.48 3159.66 3159.86 3162.60 3163.97 3169.46 3171.35 3171.52 3172.66 3174.98 3175.74 3178.03 3178.33 3181.10 3182.33 3184.36 3189.43 3190.96 3213.72 3221.01 3221.25 3221.77 3225.69 3228.07 3240.40 3243.29 3243.73 3254.12
formula: C40H60FeNO2P3
InChI: InChI=1/C39H60NP3.CO2.Fe/c1-25(2)41(26(3)4)37-22-31(13)16-19-34(37)40(35-20-17-32(14)23-38(35)42(27(5)6)28(7)8)36-21-18-33(15)24-39(36)43(29(9)10)30(11)12;2-1-3;/h16-30H,1-15H3;;
107 atoms
Fe -0.048655 0.003036 -0.312197
P  -0.841215 -2.265112 -0.698496
P  -1.718521 1.747607 -0.682197
P  2.15971 0.674027 -1.094961
N  -0.320079 -0.01941 -2.706218
C  0.244079 -1.290799 -3.100405
C  0.988853 -1.399196 -4.276332
H  1.155217 -0.519381 -4.89462
C  1.519593 -2.624058 -4.664721
H  2.101652 -2.683182 -5.584802
C  1.304163 -3.778838 -3.903533
C  0.547807 -3.656822 -2.734751
H  0.375232 -4.552674 -2.13956
C  0.025713 -2.431234 -2.306107
C  1.885862 -5.100238 -4.313598
H  1.837281 -5.236045 -5.402069
H  1.360132 -5.935083 -3.833695
H  2.945808 -5.164035 -4.024046
C  -1.746981 0.080991 -2.92378
C  -2.361254 -0.64242 -3.945254
H  -1.769316 -1.310439 -4.568353
C  -3.730452 -0.526038 -4.164072
H  -4.193418 -1.113058 -4.957729
C  -4.516512 0.333004 -3.388073
C  -3.884479 1.057971 -2.371579
H  -4.494829 1.71387 -1.751449
C  -2.514752 0.939789 -2.116275
C  -5.987015 0.486517 -3.646356
H  -6.163459 1.210113 -4.456918
H  -6.514633 0.851912 -2.756512
H  -6.439137 -0.464977 -3.95483
C  0.401559 1.127398 -3.216735
C  -0.092212 1.83499 -4.315032
H  -1.011536 1.511335 -4.798811
C  0.568934 2.964042 -4.78423
H  0.158551 3.504586 -5.63754
C  1.746469 3.414056 -4.175899
C  2.24221 2.68057 -3.094361
H  3.155145 3.030158 -2.618049
C  1.593544 1.542876 -2.599756
C  2.439719 4.65679 -4.653182
H  3.454675 4.732925 -4.244126
H  1.884611 5.554255 -4.341745
H  2.503427 4.679557 -5.749399
C  -0.135893 -3.634443 0.34542
H  -0.315838 -4.57664 -0.192836
C  1.366499 -3.412548 0.50226
H  1.564499 -2.504438 1.089795
H  1.892388 -3.325692 -0.455707
H  1.805513 -4.259302 1.048976
C  -0.792248 -3.732957 1.723097
H  -0.203777 -4.424485 2.342627
H  -1.814387 -4.117567 1.683276
H  -0.812367 -2.765166 2.241086
C  -2.638327 -2.619393 -1.085715
H  -2.968103 -1.683037 -1.554665
C  -2.802603 -3.754506 -2.090058
H  -2.413853 -4.70364 -1.693405
H  -2.300644 -3.54636 -3.042783
H  -3.873627 -3.894607 -2.298447
C  -3.503001 -2.848874 0.153492
H  -4.552799 -2.663569 -0.114139
H  -3.248927 -2.186701 0.989338
H  -3.433795 -3.887019 0.50061
C  -3.066603 1.966898 0.571931
H  -3.870806 2.535474 0.082275
C  -3.598729 0.600775 0.992407
H  -2.823417 0.0120 1.502265
H  -3.970585 0.016411 0.142191
H  -4.432002 0.733544 1.697292
C  -2.576832 2.766119 1.779442
H  -3.344896 2.72886 2.564915
H  -2.405972 3.821085 1.539375
H  -1.649818 2.351485 2.199621
C  -1.165761 3.421311 -1.281809
H  -0.570175 3.164949 -2.167436
C  -2.330829 4.295745 -1.73015
H  -2.96855 4.59163 -0.885542
H  -2.956345 3.792721 -2.479892
H  -1.937242 5.21519 -2.1877
C  -0.241396 4.127306 -0.291147
H  0.319966 4.910562 -0.819748
H  0.486841 3.443245 0.163032
H  -0.798476 4.610186 0.520038
C  3.113737 1.950284 -0.119997
H  2.552251 2.871834 -0.335555
C  4.572533 2.176567 -0.516673
H  4.942471 3.06122 0.021483
H  4.717837 2.35881 -1.587032
H  5.209852 1.331959 -0.230593
C  2.99119 1.673427 1.37852
H  3.417274 0.699371 1.654776
H  1.94658 1.703271 1.709224
H  3.539446 2.446945 1.935234
C  3.279076 -0.715846 -1.652236
H  2.557561 -1.477332 -1.979737
C  4.168131 -0.377844 -2.842881
H  4.942507 0.356061 -2.588802
H  3.58894 0.011034 -3.690183
H  4.674395 -1.295004 -3.17832
C  4.058232 -1.300657 -0.474882
H  4.474884 -2.273969 -0.770354
H  3.424988 -1.464361 0.405769
H  4.89676 -0.660936 -0.175348
C  0.079085 -0.254135 3.053056
O  0.129691 -0.620984 4.141976
O  0.026651 0.122807 1.951302
elementType: Fe P N C H O
totalener: -4061.04119678 hartree
nucrepener: 8850.46098764 hartree
cpcmener: -0.20313032 hartree
kineticenergy: 4127.59779441 hartree
exchangeener: -280.044326691166 hartree
correlationener: -13.597306748492 hartree
xcener: -293.641633439658 hartree
s2: 6.019199
dispersion: -0.179493243 hartree
s2: 6.019201
dispersion: -0.179479569 hartree
s2: 6.019203
dispersion: -0.179469924 hartree
s2: 6.019208
dispersion: -0.179491129 hartree
s2: 6.019204
dispersion: -0.179430160 hartree
s2: 6.019229
dispersion: -0.179755695 hartree
s2: 6.019216
dispersion: -0.179497914 hartree
s2: 6.019169
dispersion: -0.179269139 hartree
s2: 6.019196
dispersion: -0.179490014 hartree
dispersion: -0.179608493 hartree
s2: 6.019197
dispersion: -0.179467457 hartree
s2: 6.019187
dispersion: -0.179359520 hartree
s2: 6.019192
dispersion: -0.179534612 hartree
dispersion: -0.179409854 hartree
s2: 6.019191
dispersion: -0.179460560 hartree
s2: 6.019194
dispersion: -0.179543555 hartree
dispersion: -0.179500583 hartree
chargesum: 2.0000000
charge: 0.390022 0.419976 0.412479 0.429152 -0.455301 0.095238 -0.172401 0.209491 -0.195471 0.188327 0.058657 -0.275205 0.194464 -0.104221 -0.482766 0.198126 0.196980 0.206925 0.082780 -0.174532 0.209743 -0.197201 0.189076 0.052249 -0.278521 0.195863 -0.064596 -0.481869 0.207804 0.196647 0.198076 0.069236 -0.169432 0.206499 -0.197704 0.189126 0.059722 -0.279027 0.191603 -0.068139 -0.484425 0.196971 0.206189 0.199641 -0.419684 0.241000 -0.539270 0.219098 0.224098 0.204849 -0.473706 0.198012 0.199475 0.188851 -0.438591 0.261930 -0.474098 0.194905 0.206653 0.195748 -0.491277 0.198850 0.209818 0.204796 -0.430522 0.243330 -0.528755 0.215084 0.221733 0.203860 -0.479982 0.198607 0.207018 0.193220 -0.437471 0.265378 -0.470225 0.196816 0.198003 0.197434 -0.495696 0.197886 0.222528 0.195441 -0.463121 0.247185 -0.486703 0.198534 0.215529 0.200817 -0.489124 0.197300 0.209032 0.197151 -0.451506 0.262548 -0.462469 0.193199 0.202562 0.192873 -0.493138 0.200037 0.212481 0.201369 0.458141 -0.114043 -0.224049
charge: -0.751786 0.819575 0.821907 0.823747 0.031246 0.008205 -0.144784 0.172285 -0.117275 0.166339 -0.041493 -0.126402 0.162833 -0.162212 -0.384074 0.159341 0.156284 0.165166 0.007693 -0.144686 0.172515 -0.118759 0.166632 -0.041327 -0.128081 0.163252 -0.162177 -0.384034 0.165669 0.156602 0.159009 0.004427 -0.145889 0.172699 -0.119904 0.166562 -0.040875 -0.130319 0.161583 -0.162310 -0.384141 0.155705 0.164871 0.160580 -0.283231 0.162089 -0.396558 0.153151 0.147047 0.157611 -0.392021 0.155210 0.149918 0.143052 -0.278809 0.162393 -0.396929 0.148202 0.146058 0.154078 -0.395356 0.155156 0.146727 0.147904 -0.284090 0.162098 -0.396688 0.151372 0.147688 0.157087 -0.395350 0.155643 0.148643 0.147720 -0.282993 0.165481 -0.397018 0.148489 0.147645 0.155266 -0.394780 0.155130 0.148165 0.147502 -0.285927 0.163516 -0.397405 0.156831 0.145791 0.147685 -0.393954 0.149163 0.147867 0.154166 -0.279425 0.162605 -0.397199 0.147401 0.146100 0.153848 -0.396801 0.156156 0.148123 0.146407 0.240012 -0.015582 0.053719
qa: 0.3900 0.4200 0.4125 0.4292 -0.4553 0.0952 -0.1724 0.2095 -0.1955 0.1883 0.0587 -0.2752 0.1945 -0.1042 -0.4828 0.1981 0.1970 0.2069 0.0828 -0.1745 0.2097 -0.1972 0.1891 0.0522 -0.2785 0.1959 -0.0646 -0.4819 0.2078 0.1966 0.1981 0.0692 -0.1694 0.2065 -0.1977 0.1891 0.0597 -0.2790 0.1916 -0.0681 -0.4844 0.1970 0.2062 0.1996 -0.4197 0.2410 -0.5393 0.2191 0.2241 0.2048 -0.4737 0.1980 0.1995 0.1889 -0.4386 0.2619 -0.4741 0.1949 0.2067 0.1957 -0.4913 0.1989 0.2098 0.2048 -0.4305 0.2433 -0.5288 0.2151 0.2217 0.2039 -0.4800 0.1986 0.2070 0.1932 -0.4375 0.2654 -0.4702 0.1968 0.1980 0.1974 -0.4957 0.1979 0.2225 0.1954 -0.4631 0.2472 -0.4867 0.1985 0.2155 0.2008 -0.4891 0.1973 0.2090 0.1972 -0.4515 0.2625 -0.4625 0.1932 0.2026 0.1929 -0.4931 0.2000 0.2125 0.2014 0.4581 -0.1140 -0.2240
va: 6.2718 3.7579 3.7650 3.7379 3.0251 3.9316 3.8209 0.9280 3.8242 0.9376 3.9157 3.9010 0.9433 3.8597 3.8132 0.9269 0.9307 0.9203 3.9430 3.8133 0.9280 3.8248 0.9375 3.9188 3.9007 0.9431 3.8622 3.8140 0.9200 0.9305 0.9275 3.9509 3.8130 0.9290 3.8195 0.9369 3.9195 3.8974 0.9478 3.8588 3.8145 0.9314 0.9207 0.9256 3.9150 0.8977 3.7756 0.9247 0.9193 0.9260 3.7954 0.9290 0.9370 0.9400 3.9150 0.8695 3.7877 0.9303 0.9260 0.9290 3.7969 0.9257 0.9249 0.9260 3.9268 0.8970 3.7765 0.9307 0.9196 0.9262 3.7852 0.9294 0.9306 0.9399 3.9090 0.8640 3.7948 0.9304 0.9308 0.9272 3.7840 0.9272 0.9270 0.9364 3.9210 0.8920 3.7830 0.9271 0.9233 0.9358 3.7974 0.9311 0.9319 0.9289 3.9197 0.8680 3.7840 0.9360 0.9285 0.9306 3.7774 0.9264 0.9271 0.9351 4.1888 2.4815 2.3587
dispersion: -0.179457604 hartree
energy: -4061.242161710584 hartree
dipole: 3.14576 -3.23894 -0.09318 0.81865 -0.76820 0.05045 -3.30720 4.30283 0.99563
magnitude: 1.00125 au
magnitude: 2.54498 debye
temp: 298.15 k
press: 1.00 atm
zeropoint: 0.92745456 hartree
thermalvibcorrection: 0.05405513 hartree
thermalrotcorrection: 0.00141627 hartree
thermaltrasncorrection: 0.00141627 hartree
thermaltotal: -4060.25781948 hartree
thermalcorr: 0.05688767 hartree
nonthermalcorr: 0.92745456 hartree
totalcorr: 0.98434223 hartree
thermalcorrenthalpy: 0.00094421 hartree
totalenthalpy: -4060.25687527 hartree
vibrat: 0.09832526 hartree
rotat: 0.01820163 hartree
transl: 0.02169762 hartree
total: 0.13974412 hartree
totalentropycorr: -0.13974412 hartree
gibbsenthalpy: -4060.39661939 hartree
gibbsminuselec: 0.84554232 hartree
