program: Orca
programVersion: 5.0.4
elementType: Fe P P P N C C H C H C C H C C H H H C C H C H C C H C C H H H C C H C H C C H C C H H H C H C H H H C H H H C H C H H H C H H H C H C H H H C H H H C H C H H H C H H H C H C H H H C H H H C H C H H H C H H H C O O
keywords: PBE0 D4 DKH2 RIJCOSX DKH-def2-SV(P) def2-tzvp/c Opt Freq UNO UCO NormalPrint CPCM(acetonitrile)
charge: 1
multiplicity: 4
frequency: 0.00 0.00 0.00 0.00 0.00 0.00 -13.19 -11.31 22.62 26.41 31.57 39.44 44.89 51.61 53.72 58.37 66.07 68.65 74.92 77.47 81.48 82.43 88.56 93.30 97.21 97.56 106.10 109.42 113.65 114.08 118.37 128.07 134.98 141.74 146.49 148.50 151.57 156.99 158.71 170.76 181.88 184.92 196.13 200.13 210.42 213.30 215.42 217.56 224.96 228.47 236.03 239.42 243.64 244.20 246.45 247.90 254.52 258.86 260.51 267.60 270.70 271.65 276.97 280.75 284.52 298.13 301.68 312.61 325.14 326.82 335.75 341.50 345.89 352.27 355.55 366.58 370.38 378.64 382.04 386.45 402.36 410.93 416.05 426.90 444.13 450.15 467.55 474.09 478.13 484.30 488.42 495.90 505.40 516.03 527.45 545.14 546.36 551.00 564.85 587.91 589.82 593.92 612.21 620.82 627.86 665.02 673.84 678.75 687.86 698.88 700.08 701.50 706.94 771.47 773.65 775.11 838.55 839.89 855.83 882.78 884.59 908.39 911.05 919.26 920.87 921.58 924.30 925.30 926.17 932.24 932.75 940.06 940.88 945.55 946.80 948.85 951.15 953.66 957.61 983.83 984.26 985.03 985.79 986.50 992.41 994.55 996.46 998.22 1023.86 1025.42 1025.91 1051.81 1052.60 1056.02 1065.51 1065.68 1066.15 1073.22 1077.94 1085.22 1089.88 1105.29 1106.95 1133.53 1145.52 1148.25 1150.12 1150.56 1152.08 1176.74 1178.20 1180.71 1193.82 1194.48 1194.98 1195.26 1197.46 1198.83 1227.81 1253.04 1258.44 1261.20 1266.70 1286.73 1288.66 1291.70 1292.79 1294.92 1299.30 1300.77 1309.25 1316.50 1320.33 1324.38 1331.82 1332.89 1337.72 1346.78 1347.02 1348.82 1376.03 1389.47 1390.65 1405.59 1405.76 1407.45 1409.13 1409.87 1410.13 1413.04 1413.66 1414.36 1418.33 1420.30 1421.31 1424.62 1427.13 1429.37 1440.94 1441.72 1443.47 1471.98 1475.09 1475.42 1475.81 1477.42 1479.12 1480.82 1481.45 1482.23 1483.52 1483.95 1484.33 1485.15 1485.40 1486.44 1487.06 1488.12 1490.90 1492.66 1493.09 1494.46 1495.70 1496.85 1500.11 1500.84 1504.90 1505.77 1509.51 1510.47 1519.68 1540.35 1542.32 1550.34 1647.31 1652.68 1654.54 1687.48 1688.15 1691.61 1945.87 3055.16 3055.93 3057.31 3057.49 3058.89 3062.56 3064.78 3065.02 3065.60 3067.83 3067.84 3069.50 3069.65 3072.71 3076.49 3082.50 3086.84 3087.74 3106.26 3115.88 3137.22 3139.77 3139.94 3140.26 3140.46 3146.39 3147.90 3148.37 3149.24 3150.43 3151.90 3153.80 3155.12 3157.43 3157.61 3158.95 3159.38 3166.91 3167.55 3168.30 3169.17 3171.91 3174.60 3178.05 3180.59 3183.79 3186.23 3187.04 3188.42 3197.70 3216.99 3217.01 3217.19 3221.33 3221.76 3230.55 3238.33 3238.87 3239.65 3261.99
frequency: 22.62 26.41 31.57 39.44 44.89 51.61 53.72 58.37 66.07 68.65 74.92 77.47 81.48 82.43 88.56 93.30 97.21 97.56 106.10 109.42 113.65 114.08 118.37 128.07 134.98 141.74 146.49 148.50 151.57 156.99 158.71 170.76 181.88 184.92 196.13 200.13 210.42 213.30 215.42 217.56 224.96 228.47 236.03 239.42 243.64 244.20 246.45 247.90 254.52 258.86 260.51 267.60 270.70 271.65 276.97 280.75 284.52 298.13 301.68 312.61 325.14 326.82 335.75 341.50 345.89 352.27 355.55 366.58 370.38 378.64 382.04 386.45 402.36 410.93 416.05 426.90 444.13 450.15 467.55 474.09 478.13 484.30 488.42 495.90 505.40 516.03 527.45 545.14 546.36 551.00 564.85 587.91 589.82 593.92 612.21 620.82 627.86 665.02 673.84 678.75 687.86 698.88 700.08 701.50 706.94 771.47 773.65 775.11 838.55 839.89 855.83 882.78 884.59 908.39 911.05 919.26 920.87 921.58 924.30 925.30 926.17 932.24 932.75 940.06 940.88 945.55 946.80 948.85 951.15 953.66 957.61 983.83 984.26 985.03 985.79 986.50 992.41 994.55 996.46 998.22 1023.86 1025.42 1025.91 1051.81 1052.60 1056.02 1065.51 1065.68 1066.15 1073.22 1077.94 1085.22 1089.88 1105.29 1106.95 1133.53 1145.52 1148.25 1150.12 1150.56 1152.08 1176.74 1178.20 1180.71 1193.82 1194.48 1194.98 1195.26 1197.46 1198.83 1227.81 1253.04 1258.44 1261.20 1266.70 1286.73 1288.66 1291.70 1292.79 1294.92 1299.30 1300.77 1309.25 1316.50 1320.33 1324.38 1331.82 1332.89 1337.72 1346.78 1347.02 1348.82 1376.03 1389.47 1390.65 1405.59 1405.76 1407.45 1409.13 1409.87 1410.13 1413.04 1413.66 1414.36 1418.33 1420.30 1421.31 1424.62 1427.13 1429.37 1440.94 1441.72 1443.47 1471.98 1475.09 1475.42 1475.81 1477.42 1479.12 1480.82 1481.45 1482.23 1483.52 1483.95 1484.33 1485.15 1485.40 1486.44 1487.06 1488.12 1490.90 1492.66 1493.09 1494.46 1495.70 1496.85 1500.11 1500.84 1504.90 1505.77 1509.51 1510.47 1519.68 1540.35 1542.32 1550.34 1647.31 1652.68 1654.54 1687.48 1688.15 1691.61 1945.87 3055.16 3055.93 3057.31 3057.49 3058.89 3062.56 3064.78 3065.02 3065.60 3067.83 3067.84 3069.50 3069.65 3072.71 3076.49 3082.50 3086.84 3087.74 3106.26 3115.88 3137.22 3139.77 3139.94 3140.26 3140.46 3146.39 3147.90 3148.37 3149.24 3150.43 3151.90 3153.80 3155.12 3157.43 3157.61 3158.95 3159.38 3166.91 3167.55 3168.30 3169.17 3171.91 3174.60 3178.05 3180.59 3183.79 3186.23 3187.04 3188.42 3197.70 3216.99 3217.01 3217.19 3221.33 3221.76 3230.55 3238.33 3238.87 3239.65 3261.99
formula: C40H60FeNO2P3
InChI: InChI=1/C39H60NP3.CO2.Fe/c1-25(2)41(26(3)4)37-22-31(13)16-19-34(37)40(35-20-17-32(14)23-38(35)42(27(5)6)28(7)8)36-21-18-33(15)24-39(36)43(29(9)10)30(11)12;2-1-3;/h16-30H,1-15H3;;/q;-1;+1/rC39H60NP3.CFeO2/c1-25(2)41(26(3)4)37-22-31(13)16-19-34(37)40(35-20-17-32(14)23-38(35)42(27(5)6)28(7)8)36-21-18-33(15)24-39(36)43(29(9)10)30(11)12;3-1-2-4-1/h16-30H,1-15H3;
107 atoms
Fe -0.054109 0.010199 0.022766
P  -0.672086 -2.247521 -0.654634
P  -1.711743 1.660977 -0.62107
P  2.086545 0.726002 -0.989439
N  -0.286689 -0.053084 -2.721189
C  0.284317 -1.308838 -3.111883
C  1.003373 -1.425814 -4.302513
H  1.174045 -0.544451 -4.917961
C  1.492311 -2.662032 -4.715561
H  2.057658 -2.727531 -5.645758
C  1.248324 -3.819454 -3.970066
C  0.538062 -3.684713 -2.772054
H  0.362468 -4.580001 -2.176298
C  0.077855 -2.447356 -2.312322
C  1.714766 -5.16875 -4.435961
H  0.889075 -5.725596 -4.90489
H  2.081774 -5.777088 -3.598528
H  2.517827 -5.079912 -5.178322
C  -1.705881 0.038588 -2.915581
C  -2.330744 -0.687603 -3.93198
H  -1.744541 -1.37124 -4.543484
C  -3.692977 -0.543105 -4.172159
H  -4.16038 -1.130765 -4.963068
C  -4.462571 0.358563 -3.429384
C  -3.825569 1.072918 -2.409581
H  -4.430361 1.754718 -1.813687
C  -2.466792 0.911507 -2.115025
C  -5.921525 0.563765 -3.719178
H  -6.058488 1.306039 -4.520627
H  -6.45787 0.931216 -2.835015
H  -6.397288 -0.367569 -4.052863
C  0.414988 1.106006 -3.197246
C  -0.076856 1.815285 -4.2984
H  -0.977958 1.469108 -4.801018
C  0.555322 2.969778 -4.741098
H  0.143851 3.512214 -5.592986
C  1.707936 3.442539 -4.102912
C  2.19806 2.713054 -3.016719
H  3.081707 3.097209 -2.514824
C  1.575068 1.550369 -2.542653
C  2.394896 4.692684 -4.571986
H  3.187555 4.999254 -3.878209
H  1.682508 5.52368 -4.669303
H  2.852045 4.541525 -5.561204
C  0.027219 -3.675657 0.326835
H  -0.337393 -4.590023 -0.16591
C  1.553567 -3.652005 0.30766
H  1.923631 -2.762594 0.832934
H  1.984309 -3.658738 -0.69995
H  1.934784 -4.534479 0.841652
C  -0.435709 -3.694115 1.784747
H  -0.041256 -4.604419 2.259088
H  -1.521134 -3.701696 1.906355
H  -0.032797 -2.83804 2.340597
C  -2.494873 -2.582164 -0.938568
H  -2.831688 -1.648664 -1.40896
C  -2.744398 -3.729266 -1.911177
H  -2.355445 -4.68215 -1.523636
H  -2.293145 -3.54648 -2.894087
H  -3.82853 -3.848208 -2.056208
C  -3.293429 -2.764472 0.350533
H  -4.357852 -2.595546 0.133488
H  -2.995696 -2.064538 1.139716
H  -3.198318 -3.787907 0.736194
C  -3.171552 2.000626 0.484186
H  -3.829038 2.677231 -0.081212
C  -3.937858 0.723749 0.821807
H  -3.35355 0.093534 1.500412
H  -4.197743 0.129579 -0.062288
H  -4.87522 0.993387 1.330603
C  -2.743859 2.722853 1.762233
H  -3.604182 2.778837 2.444673
H  -2.410416 3.748824 1.573057
H  -1.94093 2.188193 2.288424
C  -1.071882 3.32745 -1.173301
H  -0.427878 3.057488 -2.018326
C  -2.167203 4.250597 -1.692499
H  -2.840249 4.580396 -0.888962
H  -2.768837 3.77194 -2.477344
H  -1.707118 5.149982 -2.128184
C  -0.189383 3.997206 -0.120921
H  0.446119 4.750898 -0.607346
H  0.469728 3.283194 0.390823
H  -0.780196 4.511518 0.646193
C  3.122222 2.027467 -0.122779
H  2.566953 2.949307 -0.352749
C  4.564433 2.212108 -0.598481
H  4.960948 3.141392 -0.163095
H  4.670934 2.286231 -1.686013
H  5.210934 1.394847 -0.257658
C  3.084314 1.843785 1.394348
H  3.554617 0.901065 1.70439
H  2.060817 1.850449 1.784912
H  3.640725 2.66531 1.86928
C  3.187919 -0.702412 -1.491513
H  2.451127 -1.476129 -1.747804
C  4.054552 -0.465805 -2.722408
H  4.85798 0.256388 -2.532138
H  3.464819 -0.106709 -3.575415
H  4.524527 -1.415559 -3.019092
C  3.995341 -1.213523 -0.298763
H  4.370265 -2.223431 -0.518501
H  3.396974 -1.274606 0.61899
H  4.864268 -0.578072 -0.090916
C  -0.58802 -0.297029 1.90025
O  -1.515587 -0.572864 2.610578
O  0.629639 -0.054425 1.963332
elementType: Fe P N C H O
totalener: -4061.17775504 hartree
nucrepener: 8999.68804610 hartree
cpcmener: -0.06818226 hartree
kineticenergy: 4128.15943701 hartree
exchangeener: -280.284403911854 hartree
correlationener: -13.674025624967 hartree
xcener: -293.958429536820 hartree
s2: 3.959243
dispersion: -0.188461695 hartree
s2: 3.963677
dispersion: -0.188705429 hartree
s2: 3.971160
dispersion: -0.187751434 hartree
s2: 3.981297
dispersion: -0.187249754 hartree
s2: 3.993574
dispersion: -0.186949902 hartree
s2: 4.006730
dispersion: -0.185796940 hartree
s2: 4.015666
dispersion: -0.185649274 hartree
s2: 4.021781
dispersion: -0.186123997 hartree
s2: 4.025551
dispersion: -0.185756338 hartree
s2: 4.029318
dispersion: -0.185495140 hartree
s2: 4.033253
dispersion: -0.185645152 hartree
s2: 4.034676
dispersion: -0.185578037 hartree
s2: 4.034056
dispersion: -0.185887005 hartree
s2: 4.035732
dispersion: -0.185465956 hartree
s2: 4.037957
dispersion: -0.185386928 hartree
s2: 4.037585
dispersion: -0.185829087 hartree
s2: 4.037054
dispersion: -0.185586348 hartree
s2: 4.038104
dispersion: -0.185585287 hartree
s2: 4.038574
dispersion: -0.185687170 hartree
s2: 4.038758
dispersion: -0.185689307 hartree
s2: 4.039506
dispersion: -0.185678504 hartree
s2: 4.039499
dispersion: -0.185703196 hartree
s2: 4.038938
chargesum: 1.0000000
charge: -0.015916 0.439996 0.442637 0.437540 -0.396148 0.095028 -0.179359 0.200370 -0.207062 0.182285 0.057389 -0.280691 0.190072 -0.095396 -0.482915 0.203529 0.195627 0.193303 0.057417 -0.170626 0.202423 -0.203541 0.183290 0.054219 -0.288742 0.191271 -0.064131 -0.482243 0.204178 0.194373 0.194940 0.052833 -0.162058 0.198100 -0.207320 0.183089 0.063080 -0.291880 0.187906 -0.073055 -0.485814 0.193901 0.197602 0.201747 -0.429319 0.233079 -0.512157 0.205660 0.215256 0.194862 -0.479599 0.191876 0.194831 0.194162 -0.440441 0.260083 -0.471588 0.190876 0.202914 0.190286 -0.501232 0.193508 0.209992 0.199790 -0.440620 0.233810 -0.519631 0.213456 0.210160 0.188670 -0.480743 0.191735 0.199102 0.194009 -0.439797 0.265321 -0.471409 0.194224 0.194108 0.192407 -0.499523 0.194765 0.220739 0.195028 -0.468068 0.236442 -0.485326 0.191129 0.208419 0.195890 -0.480713 0.186983 0.219746 0.184864 -0.453666 0.257403 -0.459548 0.187701 0.197875 0.184377 -0.497143 0.194852 0.214563 0.195018 0.401445 -0.271424 -0.330712
charge: -1.075830 0.838987 0.842889 0.821051 0.005465 0.003380 -0.149231 0.167716 -0.126930 0.162522 -0.049445 -0.128837 0.160026 -0.171774 -0.384949 0.162781 0.157199 0.154602 0.002182 -0.149822 0.168858 -0.124755 0.163253 -0.048730 -0.132250 0.160155 -0.169210 -0.384629 0.163241 0.155263 0.156886 -0.003470 -0.149130 0.168657 -0.127711 0.163023 -0.047782 -0.139284 0.159271 -0.168726 -0.384856 0.153517 0.159504 0.162060 -0.283331 0.157809 -0.396666 0.148642 0.144796 0.153500 -0.395446 0.152799 0.146322 0.145636 -0.279690 0.160741 -0.397825 0.145319 0.144429 0.151109 -0.399348 0.151328 0.143321 0.145396 -0.287102 0.154880 -0.407350 0.147339 0.142611 0.150480 -0.395082 0.152342 0.144994 0.146374 -0.284272 0.164220 -0.397429 0.146135 0.145615 0.152403 -0.394203 0.152245 0.147717 0.145851 -0.291113 0.157972 -0.399691 0.152550 0.142807 0.145057 -0.394750 0.144089 0.148754 0.147252 -0.283416 0.158968 -0.397500 0.144143 0.143124 0.148961 -0.395315 0.151639 0.145985 0.143516 0.141674 -0.166552 -0.049900
qa: -0.0159 0.4400 0.4426 0.4375 -0.3961 0.0950 -0.1794 0.2004 -0.2071 0.1823 0.0574 -0.2807 0.1901 -0.0954 -0.4829 0.2035 0.1956 0.1933 0.0574 -0.1706 0.2024 -0.2035 0.1833 0.0542 -0.2887 0.1913 -0.0641 -0.4822 0.2042 0.1944 0.1949 0.0528 -0.1621 0.1981 -0.2073 0.1831 0.0631 -0.2919 0.1879 -0.0731 -0.4858 0.1939 0.1976 0.2017 -0.4293 0.2331 -0.5122 0.2057 0.2153 0.1949 -0.4796 0.1919 0.1948 0.1942 -0.4404 0.2601 -0.4716 0.1909 0.2029 0.1903 -0.5012 0.1935 0.2100 0.1998 -0.4406 0.2338 -0.5196 0.2135 0.2102 0.1887 -0.4807 0.1917 0.1991 0.1940 -0.4398 0.2653 -0.4714 0.1942 0.1941 0.1924 -0.4995 0.1948 0.2207 0.1950 -0.4681 0.2364 -0.4853 0.1911 0.2084 0.1959 -0.4807 0.1870 0.2197 0.1849 -0.4537 0.2574 -0.4595 0.1877 0.1979 0.1844 -0.4971 0.1949 0.2146 0.1950 0.4014 -0.2714 -0.3307
va: 6.4441 3.7632 3.7726 3.6889 3.0624 3.9837 3.8038 0.9325 3.8373 0.9399 3.9086 3.8692 0.9405 3.8462 3.8153 0.9208 0.9273 0.9314 3.9967 3.7979 0.9304 3.8252 0.9388 3.9120 3.8982 0.9421 3.8412 3.8152 0.9207 0.9306 0.9286 3.9947 3.7957 0.9320 3.8145 0.9380 3.9097 3.8959 0.9461 3.8468 3.8164 0.9331 0.9249 0.9221 3.9241 0.8998 3.7689 0.9410 0.9247 0.9287 3.7968 0.9293 0.9423 0.9409 3.9184 0.8688 3.7933 0.9323 0.9282 0.9304 3.7854 0.9266 0.9460 0.9226 3.9339 0.8994 3.7596 0.9551 0.9250 0.9296 3.7940 0.9308 0.9339 0.9404 3.9070 0.8619 3.8031 0.9302 0.9326 0.9284 3.7882 0.9269 0.9275 0.9357 3.9285 0.8961 3.7845 0.9284 0.9242 0.9364 3.8013 0.9355 0.9272 0.9297 3.9289 0.8685 3.7940 0.9367 0.9307 0.9321 3.7835 0.9268 0.9257 0.9361 4.0140 2.2728 2.1873
dispersion: -0.185714967 hartree
energy: -4061.381885664950 hartree
dipole: 4.81246 -4.72621 0.08626 1.29523 -1.00660 0.28863 -3.25302 0.05345 -3.19957
magnitude: 3.21372 au
magnitude: 8.16863 debye
temp: 298.15 k
press: 1.00 atm
zeropoint: 0.92649163 hartree
thermalvibcorrection: 0.05149862 hartree
thermalrotcorrection: 0.00141627 hartree
thermaltrasncorrection: 0.00141627 hartree
thermaltotal: -4060.40106287 hartree
thermalcorr: 0.05433116 hartree
nonthermalcorr: 0.92649163 hartree
totalcorr: 0.98082279 hartree
thermalcorrenthalpy: 0.00094421 hartree
totalenthalpy: -4060.40011866 hartree
vibrat: 0.09176481 hartree
rotat: 0.01816252 hartree
transl: 0.02169762 hartree
total: 0.13293387 hartree
totalentropycorr: -0.13293387 hartree
gibbsenthalpy: -4060.53305253 hartree
gibbsminuselec: 0.84883313 hartree
