program: Orca
programVersion: 5.0.4
elementType: Fe P P P N C C H C H C C H C C H H H C C H C H C C H C C H H H C C H C H C C H C C H H H C H C H H H C H H H C H C H H H C H H H C H C H H H C H H H C H C H H H C H H H C H C H H H C H H H C H C H H H C H H H C O O H
keywords: PBE0 D4 DKH2 RIJCOSX DKH-def2-SV(P) def2-tzvp/c Opt Freq UNO UCO NormalPrint CPCM(acetonitrile)
charge: 2
multiplicity: 4
frequency: 0.00 0.00 0.00 0.00 0.00 0.00 7.08 30.70 33.24 33.58 37.32 39.05 45.52 47.63 60.11 64.64 71.75 77.32 81.05 84.69 85.90 87.96 93.68 95.51 100.92 102.65 106.14 112.85 116.53 121.00 124.04 128.72 130.51 143.12 143.43 150.38 152.22 155.68 159.33 166.51 177.71 182.76 186.46 191.38 197.36 206.31 210.39 211.75 219.17 226.74 227.49 232.75 237.26 241.92 247.35 250.76 252.28 257.09 258.90 264.28 266.29 269.98 275.46 282.42 284.77 298.05 303.87 321.01 327.14 335.14 342.52 350.38 353.70 356.32 365.17 368.06 374.94 384.47 386.68 388.69 404.97 408.68 419.34 426.96 445.47 448.41 470.00 474.17 479.39 483.45 488.05 490.06 496.41 507.89 512.31 526.99 544.07 547.34 560.70 583.42 587.77 589.42 612.63 624.05 628.91 671.37 672.69 674.00 677.78 688.39 702.61 703.81 706.58 729.13 766.34 769.36 785.40 837.90 840.68 862.35 880.98 883.10 909.69 916.35 917.62 918.61 920.93 922.26 924.97 926.09 931.62 937.70 940.90 943.36 943.85 946.05 948.46 950.58 951.44 957.29 983.71 984.20 984.35 987.10 987.21 991.05 999.77 1001.00 1003.60 1027.67 1027.74 1028.07 1052.49 1053.72 1059.08 1065.35 1066.13 1066.39 1073.79 1077.17 1083.83 1086.08 1097.68 1100.24 1137.00 1146.26 1147.36 1148.19 1150.18 1153.82 1168.02 1181.90 1184.21 1184.53 1192.35 1193.83 1195.29 1195.72 1196.80 1198.96 1216.55 1239.48 1249.63 1267.98 1272.80 1277.65 1286.81 1288.67 1291.07 1294.86 1295.36 1315.31 1315.48 1318.41 1322.33 1331.91 1335.05 1336.69 1341.89 1342.98 1345.78 1347.86 1385.35 1395.52 1396.22 1405.41 1406.77 1407.70 1410.24 1410.79 1410.90 1412.98 1413.18 1414.27 1419.13 1419.45 1422.07 1427.24 1428.10 1431.09 1441.82 1442.36 1442.70 1474.52 1475.55 1476.31 1477.48 1477.74 1479.18 1479.69 1480.55 1481.75 1483.09 1484.25 1484.58 1484.78 1486.62 1487.54 1487.80 1489.65 1492.46 1492.59 1493.69 1494.49 1496.39 1498.50 1500.11 1500.93 1501.77 1507.66 1509.18 1510.19 1516.22 1536.20 1540.19 1547.56 1654.59 1659.46 1660.14 1684.66 1685.10 1687.82 1786.12 3059.07 3060.86 3060.92 3061.22 3061.89 3067.38 3068.86 3070.68 3071.09 3072.07 3072.51 3077.94 3078.72 3080.76 3082.28 3086.14 3090.67 3091.04 3098.10 3120.95 3127.21 3145.21 3145.37 3145.93 3146.57 3147.31 3154.47 3156.88 3157.70 3158.35 3159.82 3161.97 3164.88 3167.24 3170.54 3171.22 3173.61 3174.37 3174.82 3174.87 3175.16 3178.68 3178.97 3180.18 3184.94 3186.24 3193.66 3195.14 3203.98 3210.76 3223.51 3224.54 3225.73 3225.76 3226.79 3227.97 3246.32 3248.52 3249.75 3253.38 3601.18
frequency: 7.08 30.70 33.24 33.58 37.32 39.05 45.52 47.63 60.11 64.64 71.75 77.32 81.05 84.69 85.90 87.96 93.68 95.51 100.92 102.65 106.14 112.85 116.53 121.00 124.04 128.72 130.51 143.12 143.43 150.38 152.22 155.68 159.33 166.51 177.71 182.76 186.46 191.38 197.36 206.31 210.39 211.75 219.17 226.74 227.49 232.75 237.26 241.92 247.35 250.76 252.28 257.09 258.90 264.28 266.29 269.98 275.46 282.42 284.77 298.05 303.87 321.01 327.14 335.14 342.52 350.38 353.70 356.32 365.17 368.06 374.94 384.47 386.68 388.69 404.97 408.68 419.34 426.96 445.47 448.41 470.00 474.17 479.39 483.45 488.05 490.06 496.41 507.89 512.31 526.99 544.07 547.34 560.70 583.42 587.77 589.42 612.63 624.05 628.91 671.37 672.69 674.00 677.78 688.39 702.61 703.81 706.58 729.13 766.34 769.36 785.40 837.90 840.68 862.35 880.98 883.10 909.69 916.35 917.62 918.61 920.93 922.26 924.97 926.09 931.62 937.70 940.90 943.36 943.85 946.05 948.46 950.58 951.44 957.29 983.71 984.20 984.35 987.10 987.21 991.05 999.77 1001.00 1003.60 1027.67 1027.74 1028.07 1052.49 1053.72 1059.08 1065.35 1066.13 1066.39 1073.79 1077.17 1083.83 1086.08 1097.68 1100.24 1137.00 1146.26 1147.36 1148.19 1150.18 1153.82 1168.02 1181.90 1184.21 1184.53 1192.35 1193.83 1195.29 1195.72 1196.80 1198.96 1216.55 1239.48 1249.63 1267.98 1272.80 1277.65 1286.81 1288.67 1291.07 1294.86 1295.36 1315.31 1315.48 1318.41 1322.33 1331.91 1335.05 1336.69 1341.89 1342.98 1345.78 1347.86 1385.35 1395.52 1396.22 1405.41 1406.77 1407.70 1410.24 1410.79 1410.90 1412.98 1413.18 1414.27 1419.13 1419.45 1422.07 1427.24 1428.10 1431.09 1441.82 1442.36 1442.70 1474.52 1475.55 1476.31 1477.48 1477.74 1479.18 1479.69 1480.55 1481.75 1483.09 1484.25 1484.58 1484.78 1486.62 1487.54 1487.80 1489.65 1492.46 1492.59 1493.69 1494.49 1496.39 1498.50 1500.11 1500.93 1501.77 1507.66 1509.18 1510.19 1516.22 1536.20 1540.19 1547.56 1654.59 1659.46 1660.14 1684.66 1685.10 1687.82 1786.12 3059.07 3060.86 3060.92 3061.22 3061.89 3067.38 3068.86 3070.68 3071.09 3072.07 3072.51 3077.94 3078.72 3080.76 3082.28 3086.14 3090.67 3091.04 3098.10 3120.95 3127.21 3145.21 3145.37 3145.93 3146.57 3147.31 3154.47 3156.88 3157.70 3158.35 3159.82 3161.97 3164.88 3167.24 3170.54 3171.22 3173.61 3174.37 3174.82 3174.87 3175.16 3178.68 3178.97 3180.18 3184.94 3186.24 3193.66 3195.14 3203.98 3210.76 3223.51 3224.54 3225.73 3225.76 3226.79 3227.97 3246.32 3248.52 3249.75 3253.38 3601.18
formula: C40H61FeNO2P3
InChI: InChI=1/C39H60NP3.CHO2.Fe/c1-25(2)41(26(3)4)37-22-31(13)16-19-34(37)40(35-20-17-32(14)23-38(35)42(27(5)6)28(7)8)36-21-18-33(15)24-39(36)43(29(9)10)30(11)12;2-1-3;/h16-30H,1-15H3;2H;/rC40H61FeNO2P3/c1-25(2)45(26(3)4)37-22-31(13)16-19-34(37)42-35-20-17-32(14)23-38(35)46(27(5)6,28(7)8)41(42,40(43)44)47(29(9)10,30(11)12)39-24-33(15)18-21-36(39)42/h16-30,43H,1-15H3
108 atoms
Fe -0.049777 -0.021058 -0.421555
P  -0.787831 -2.279311 -0.658101
P  -1.705749 1.769314 -0.668196
P  2.112003 0.773839 -0.945617
N  -0.269023 -0.028615 -2.592803
C  0.286389 -1.300174 -3.044372
C  1.010326 -1.389777 -4.230198
H  1.226692 -0.497045 -4.812555
C  1.454919 -2.629786 -4.681476
H  2.03163 -2.680297 -5.605127
C  1.157241 -3.805501 -3.984958
C  0.437142 -3.692775 -2.790618
H  0.213308 -4.60149 -2.232809
C  0.02151 -2.45538 -2.29249
C  1.579881 -5.148508 -4.503265
H  0.78792 -5.583813 -5.131765
H  1.772432 -5.852242 -3.683579
H  2.484108 -5.071569 -5.119822
C  -1.705473 0.064025 -2.862825
C  -2.287306 -0.674179 -3.89043
H  -1.685972 -1.354511 -4.489686
C  -3.649944 -0.553964 -4.149828
H  -4.090919 -1.151467 -4.947873
C  -4.456465 0.315841 -3.408534
C  -3.852104 1.055148 -2.385345
H  -4.476398 1.721056 -1.790269
C  -2.490125 0.9414 -2.095065
C  -5.918348 0.469607 -3.708849
H  -6.073619 1.244495 -4.47518
H  -6.48084 0.772076 -2.81665
H  -6.347129 -0.463823 -4.094797
C  0.442118 1.127281 -3.13572
C  -0.026835 1.771751 -4.279197
H  -0.927368 1.418936 -4.777075
C  0.63863 2.887784 -4.775464
H  0.247349 3.387592 -5.661641
C  1.788344 3.382584 -4.149423
C  2.249727 2.716939 -3.009574
H  3.132038 3.110031 -2.509487
C  1.596009 1.593833 -2.492953
C  2.512685 4.579799 -4.689792
H  3.155911 5.037297 -3.928063
H  1.808889 5.33838 -5.056042
H  3.152585 4.291033 -5.537389
C  -0.122691 -3.697837 0.352017
H  -0.560588 -4.592809 -0.118603
C  1.402188 -3.793134 0.290786
H  1.865536 -2.946112 0.805975
H  1.800096 -3.83287 -0.728897
H  1.712823 -4.713088 0.806211
C  -0.580296 -3.652516 1.812015
H  -0.158445 -4.525074 2.330598
H  -1.665381 -3.69327 1.931304
H  -0.21093 -2.758581 2.327336
C  -2.60841 -2.588415 -0.980291
H  -2.948502 -1.635454 -1.406657
C  -2.827195 -3.688892 -2.014044
H  -2.434719 -4.656259 -1.669312
H  -2.370118 -3.453658 -2.982424
H  -3.90877 -3.807734 -2.174675
C  -3.415467 -2.857498 0.287262
H  -4.481595 -2.732772 0.051231
H  -3.172447 -2.171932 1.107084
H  -3.275273 -3.888328 0.636677
C  -3.064656 1.978606 0.576143
H  -3.8615 2.53964 0.065137
C  -3.599799 0.613524 0.995152
H  -2.821874 0.02978 1.503315
H  -3.976914 0.032836 0.14452
H  -4.43366 0.751175 1.698597
C  -2.60308 2.790506 1.786229
H  -3.39574 2.766195 2.547711
H  -2.422686 3.842073 1.538506
H  -1.694078 2.369373 2.233824
C  -1.188815 3.450089 -1.2855
H  -0.576472 3.201261 -2.162017
C  -2.371545 4.289257 -1.754787
H  -3.028373 4.571707 -0.920427
H  -2.972537 3.768388 -2.512107
H  -1.995269 5.217275 -2.209628
C  -0.299926 4.193687 -0.289257
H  0.26745 4.969109 -0.82272
H  0.420518 3.531242 0.205407
H  -0.886865 4.690978 0.491393
C  2.990815 2.098993 0.029737
H  2.444265 2.998565 -0.289344
C  4.468057 2.29221 -0.317549
H  4.807204 3.227537 0.150015
H  4.664404 2.372533 -1.39234
H  5.089654 1.483243 0.082226
C  2.799779 1.952262 1.536892
H  3.264782 1.037624 1.92495
H  1.739966 1.960015 1.820647
H  3.278961 2.808272 2.032819
C  3.232734 -0.644354 -1.430508
H  2.508124 -1.422944 -1.71176
C  4.097467 -0.350592 -2.652298
H  4.866583 0.403452 -2.443501
H  3.504592 -0.012376 -3.511093
H  4.609889 -1.278254 -2.945761
C  4.045193 -1.17838 -0.252154
H  4.456715 -2.158789 -0.530435
H  3.43794 -1.311874 0.648824
H  4.889978 -0.524368 -0.007386
C  0.408135 -0.280098 1.413387
O  -0.405253 0.254898 2.126222
O  1.472197 -0.932721 1.83673
H  1.508829 -0.921385 2.815728
elementType: Fe P N C H O
totalener: -4061.59801853 hartree
nucrepener: 9037.89668623 hartree
cpcmener: -0.19727782 hartree
kineticenergy: 4128.55931793 hartree
exchangeener: -280.325359930795 hartree
correlationener: -13.664720396374 hartree
xcener: -293.990080327169 hartree
s2: 3.916798
dispersion: -0.185908887 hartree
s2: 3.918713
dispersion: -0.186108498 hartree
s2: 3.926105
dispersion: -0.186123464 hartree
s2: 3.930450
dispersion: -0.185695674 hartree
s2: 3.930898
dispersion: -0.185696615 hartree
s2: 3.930106
dispersion: -0.185493195 hartree
s2: 3.930780
dispersion: -0.185069722 hartree
s2: 3.931957
dispersion: -0.185010334 hartree
s2: 3.931388
dispersion: -0.185598499 hartree
s2: 3.929428
dispersion: -0.185138672 hartree
s2: 3.928880
dispersion: -0.185072520 hartree
s2: 3.928355
dispersion: -0.185383875 hartree
s2: 3.926666
dispersion: -0.185469368 hartree
s2: 3.923259
dispersion: -0.185269022 hartree
s2: 3.921426
dispersion: -0.185373228 hartree
s2: 3.916825
dispersion: -0.185637046 hartree
s2: 3.915620
dispersion: -0.185584549 hartree
s2: 3.913717
dispersion: -0.185581229 hartree
s2: 3.909840
dispersion: -0.185644757 hartree
s2: 3.905040
dispersion: -0.185751901 hartree
s2: 3.903738
dispersion: -0.185778741 hartree
s2: 3.903226
dispersion: -0.185784643 hartree
s2: 3.903357
dispersion: -0.185764791 hartree
s2: 3.903574
dispersion: -0.185743100 hartree
s2: 3.903750
dispersion: -0.185725795 hartree
s2: 3.903876
dispersion: -0.185718193 hartree
s2: 3.903982
chargesum: 2.0000000
charge: -0.060984 0.506665 0.418799 0.528983 -0.498092 0.115663 -0.178750 0.218602 -0.189893 0.192876 0.059709 -0.277391 0.203690 -0.095635 -0.481238 0.210355 0.199687 0.199021 0.100533 -0.174076 0.217324 -0.194527 0.192226 0.054199 -0.273097 0.199183 -0.063072 -0.481636 0.210225 0.198835 0.199281 0.101542 -0.168352 0.213921 -0.189404 0.194700 0.055988 -0.266318 0.199842 -0.083759 -0.483178 0.199494 0.201451 0.210930 -0.430523 0.244786 -0.515272 0.217846 0.215804 0.199053 -0.475836 0.198963 0.200103 0.187177 -0.441436 0.264632 -0.479400 0.200424 0.212231 0.200931 -0.494574 0.202790 0.216983 0.208746 -0.419301 0.242186 -0.534298 0.225141 0.215878 0.200686 -0.482941 0.195297 0.201853 0.202557 -0.431777 0.261477 -0.471006 0.198195 0.199485 0.198845 -0.495689 0.198911 0.221108 0.198348 -0.465182 0.255927 -0.489696 0.204283 0.218880 0.206602 -0.487189 0.199595 0.214379 0.201409 -0.453457 0.268388 -0.464135 0.199305 0.209348 0.198567 -0.495909 0.200199 0.225506 0.199443 0.367918 -0.246348 -0.390444 0.419904
charge: -1.093596 0.885835 0.839066 0.905065 0.064466 0.016090 -0.141235 0.175800 -0.112067 0.168970 -0.035578 -0.118578 0.166858 -0.155799 -0.383431 0.167383 0.159045 0.158866 0.013790 -0.141494 0.176034 -0.114997 0.168647 -0.035713 -0.123824 0.165230 -0.157069 -0.383633 0.167334 0.158395 0.159316 0.011193 -0.138699 0.176756 -0.112766 0.169903 -0.032944 -0.123712 0.165785 -0.154881 -0.383309 0.157834 0.161310 0.167870 -0.279981 0.166085 -0.404026 0.148736 0.146777 0.156887 -0.396281 0.157326 0.149773 0.144099 -0.273060 0.163762 -0.396342 0.149554 0.147280 0.157541 -0.395889 0.157759 0.148712 0.150211 -0.280316 0.161344 -0.400421 0.151583 0.145541 0.155712 -0.399001 0.154294 0.146451 0.147946 -0.281335 0.164523 -0.396935 0.149137 0.147999 0.156181 -0.395117 0.155840 0.147333 0.148461 -0.281138 0.167049 -0.396538 0.160699 0.147566 0.150845 -0.395034 0.149312 0.149226 0.157666 -0.270963 0.169017 -0.395993 0.149616 0.147245 0.157523 -0.400548 0.157490 0.147557 0.147415 0.144884 -0.101362 -0.180694 0.357496
qa: -0.0610 0.5067 0.4188 0.5290 -0.4981 0.1157 -0.1788 0.2186 -0.1899 0.1929 0.0597 -0.2774 0.2037 -0.0956 -0.4812 0.2104 0.1997 0.1990 0.1005 -0.1741 0.2173 -0.1945 0.1922 0.0542 -0.2731 0.1992 -0.0631 -0.4816 0.2102 0.1988 0.1993 0.1015 -0.1684 0.2139 -0.1894 0.1947 0.0560 -0.2663 0.1998 -0.0838 -0.4832 0.1995 0.2015 0.2109 -0.4305 0.2448 -0.5153 0.2178 0.2158 0.1991 -0.4758 0.1990 0.2001 0.1872 -0.4414 0.2646 -0.4794 0.2004 0.2122 0.2009 -0.4946 0.2028 0.2170 0.2087 -0.4193 0.2422 -0.5343 0.2251 0.2159 0.2007 -0.4829 0.1953 0.2019 0.2026 -0.4318 0.2615 -0.4710 0.1982 0.1995 0.1988 -0.4957 0.1989 0.2211 0.1983 -0.4652 0.2559 -0.4897 0.2043 0.2189 0.2066 -0.4872 0.1996 0.2144 0.2014 -0.4535 0.2684 -0.4641 0.1993 0.2093 0.1986 -0.4959 0.2002 0.2255 0.1994 0.3679 -0.2463 -0.3904 0.4199
va: 6.7166 3.8682 3.7795 3.8967 3.0242 3.8741 3.8287 0.9236 3.8370 0.9371 3.9149 3.8949 0.9365 3.8719 3.8123 0.9194 0.9280 0.9288 3.8759 3.8183 0.9229 3.8285 0.9371 3.9170 3.9000 0.9419 3.8652 3.8130 0.9195 0.9291 0.9281 3.8897 3.8197 0.9261 3.8231 0.9358 3.9279 3.8927 0.9445 3.8862 3.8131 0.9304 0.9261 0.9195 3.9208 0.8956 3.7689 0.9379 0.9231 0.9279 3.7876 0.9290 0.9388 0.9508 3.9178 0.8700 3.7795 0.9303 0.9240 0.9287 3.7914 0.9255 0.9219 0.9203 3.9344 0.8971 3.7744 0.9333 0.9217 0.9272 3.7809 0.9305 0.9324 0.9446 3.9122 0.8673 3.7958 0.9298 0.9300 0.9267 3.7825 0.9267 0.9257 0.9357 3.9257 0.8886 3.7745 0.9262 0.9237 0.9341 3.7935 0.9361 0.9345 0.9276 3.9256 0.8666 3.7811 0.9339 0.9253 0.9298 3.7666 0.9271 0.9333 0.9365 3.9233 2.2515 2.1183 0.8197
dispersion: -0.185717299 hartree
energy: -4061.795161951167 hartree
dipole: 2.27822 -1.69117 0.58705 0.49149 -0.80917 -0.31768 4.64352 -5.19866 -0.55514
magnitude: 0.86817 au
magnitude: 2.20671 debye
temp: 298.15 k
press: 1.00 atm
zeropoint: 0.93966776 hartree
thermalvibcorrection: 0.05333588 hartree
thermalrotcorrection: 0.00141627 hartree
thermaltrasncorrection: 0.00141627 hartree
thermaltotal: -4060.79932577 hartree
thermalcorr: 0.05616843 hartree
nonthermalcorr: 0.93966776 hartree
totalcorr: 0.99583618 hartree
thermalcorrenthalpy: 0.00094421 hartree
totalenthalpy: -4060.79838156 hartree
vibrat: 0.09608452 hartree
rotat: 0.01815031 hartree
transl: 0.02169956 hartree
total: 0.13724331 hartree
totalentropycorr: -0.13724331 hartree
gibbsenthalpy: -4060.93562486 hartree
gibbsminuselec: 0.85953709 hartree
