program: Orca
programVersion: 5.0.4
elementType: Fe P P P N C C H C H C C H C C H H H C C H C H C C H C C H H H C C H C H C C H C C H H H C H C H H H C H H H C H C H H H C H H H C H C H H H C H H H C H C H H H C H H H C H C H H H C H H H C H C H H H C H H H C O O
keywords: PBE0 D4 DKH2 RIJCOSX DKH-def2-SV(P) def2-tzvp/c Opt Freq UNO UCO NormalPrint CPCM(acetonitrile)
charge: 0
multiplicity: 3
frequency: 0.00 0.00 0.00 0.00 0.00 0.00 16.78 23.59 24.84 26.95 30.94 40.83 50.01 56.14 59.84 67.38 71.00 71.68 80.54 83.75 88.22 90.62 93.85 99.16 103.94 111.87 112.84 116.93 123.31 127.68 131.55 135.99 139.97 143.24 147.48 152.90 158.49 161.57 167.91 181.34 184.41 189.26 197.22 204.54 210.18 215.96 216.89 219.36 228.11 233.73 236.76 240.11 245.36 249.98 252.96 253.07 259.74 263.68 264.68 269.07 270.01 274.09 282.94 288.05 301.32 304.00 310.92 327.03 328.21 337.31 342.21 345.90 358.38 363.34 364.99 370.97 372.69 378.59 383.73 388.60 402.36 415.42 418.78 430.39 444.15 451.44 467.25 474.07 477.25 483.32 489.38 496.21 502.98 514.88 527.70 545.62 551.21 566.17 582.83 591.19 595.08 600.48 609.56 610.39 625.28 657.68 663.72 669.57 678.35 696.32 698.35 704.35 739.29 771.26 774.08 775.25 836.05 837.27 850.76 879.45 882.00 903.46 908.61 917.79 920.03 922.12 924.50 925.93 927.81 933.79 934.22 938.99 940.60 943.82 945.14 947.79 953.77 956.00 958.63 982.37 982.80 984.28 986.05 986.46 987.34 990.16 992.72 992.98 1022.35 1023.19 1023.75 1049.24 1049.86 1050.82 1064.51 1064.98 1065.02 1069.86 1073.71 1082.91 1089.39 1104.29 1106.54 1133.54 1144.09 1145.05 1148.74 1149.44 1150.86 1170.55 1171.22 1173.54 1192.08 1193.13 1193.98 1194.29 1197.05 1201.66 1227.47 1233.80 1259.17 1261.17 1264.96 1282.91 1286.26 1287.27 1292.12 1294.31 1302.59 1302.77 1305.71 1314.27 1331.39 1334.94 1337.78 1340.08 1342.21 1344.41 1349.36 1354.07 1372.29 1386.11 1388.31 1402.32 1402.73 1403.25 1405.50 1406.39 1407.22 1412.73 1413.34 1414.17 1415.70 1416.49 1417.04 1422.15 1423.32 1427.24 1440.16 1441.59 1443.65 1472.26 1474.74 1475.01 1475.15 1477.87 1479.19 1481.02 1482.29 1483.16 1483.42 1483.77 1484.26 1485.45 1485.85 1486.28 1486.85 1488.89 1491.36 1491.83 1492.21 1494.48 1496.08 1497.44 1501.25 1503.20 1506.47 1506.83 1511.37 1513.30 1531.45 1540.76 1542.21 1550.38 1644.42 1649.83 1651.46 1685.46 1686.25 1690.85 1749.73 3046.05 3046.78 3050.43 3053.23 3053.65 3053.75 3054.66 3055.11 3055.98 3056.74 3060.66 3062.03 3063.91 3066.48 3068.49 3074.96 3079.70 3088.23 3110.15 3112.82 3125.69 3126.69 3134.40 3135.11 3135.14 3136.90 3137.67 3138.66 3142.17 3142.60 3144.91 3145.56 3148.28 3149.53 3153.43 3154.31 3154.67 3161.34 3161.40 3162.09 3162.93 3163.84 3171.48 3172.22 3175.57 3175.94 3180.89 3185.49 3185.94 3186.90 3209.27 3209.92 3210.28 3220.06 3220.69 3229.32 3230.36 3231.37 3232.35 3264.17
frequency: 16.78 23.59 24.84 26.95 30.94 40.83 50.01 56.14 59.84 67.38 71.00 71.68 80.54 83.75 88.22 90.62 93.85 99.16 103.94 111.87 112.84 116.93 123.31 127.68 131.55 135.99 139.97 143.24 147.48 152.90 158.49 161.57 167.91 181.34 184.41 189.26 197.22 204.54 210.18 215.96 216.89 219.36 228.11 233.73 236.76 240.11 245.36 249.98 252.96 253.07 259.74 263.68 264.68 269.07 270.01 274.09 282.94 288.05 301.32 304.00 310.92 327.03 328.21 337.31 342.21 345.90 358.38 363.34 364.99 370.97 372.69 378.59 383.73 388.60 402.36 415.42 418.78 430.39 444.15 451.44 467.25 474.07 477.25 483.32 489.38 496.21 502.98 514.88 527.70 545.62 551.21 566.17 582.83 591.19 595.08 600.48 609.56 610.39 625.28 657.68 663.72 669.57 678.35 696.32 698.35 704.35 739.29 771.26 774.08 775.25 836.05 837.27 850.76 879.45 882.00 903.46 908.61 917.79 920.03 922.12 924.50 925.93 927.81 933.79 934.22 938.99 940.60 943.82 945.14 947.79 953.77 956.00 958.63 982.37 982.80 984.28 986.05 986.46 987.34 990.16 992.72 992.98 1022.35 1023.19 1023.75 1049.24 1049.86 1050.82 1064.51 1064.98 1065.02 1069.86 1073.71 1082.91 1089.39 1104.29 1106.54 1133.54 1144.09 1145.05 1148.74 1149.44 1150.86 1170.55 1171.22 1173.54 1192.08 1193.13 1193.98 1194.29 1197.05 1201.66 1227.47 1233.80 1259.17 1261.17 1264.96 1282.91 1286.26 1287.27 1292.12 1294.31 1302.59 1302.77 1305.71 1314.27 1331.39 1334.94 1337.78 1340.08 1342.21 1344.41 1349.36 1354.07 1372.29 1386.11 1388.31 1402.32 1402.73 1403.25 1405.50 1406.39 1407.22 1412.73 1413.34 1414.17 1415.70 1416.49 1417.04 1422.15 1423.32 1427.24 1440.16 1441.59 1443.65 1472.26 1474.74 1475.01 1475.15 1477.87 1479.19 1481.02 1482.29 1483.16 1483.42 1483.77 1484.26 1485.45 1485.85 1486.28 1486.85 1488.89 1491.36 1491.83 1492.21 1494.48 1496.08 1497.44 1501.25 1503.20 1506.47 1506.83 1511.37 1513.30 1531.45 1540.76 1542.21 1550.38 1644.42 1649.83 1651.46 1685.46 1686.25 1690.85 1749.73 3046.05 3046.78 3050.43 3053.23 3053.65 3053.75 3054.66 3055.11 3055.98 3056.74 3060.66 3062.03 3063.91 3066.48 3068.49 3074.96 3079.70 3088.23 3110.15 3112.82 3125.69 3126.69 3134.40 3135.11 3135.14 3136.90 3137.67 3138.66 3142.17 3142.60 3144.91 3145.56 3148.28 3149.53 3153.43 3154.31 3154.67 3161.34 3161.40 3162.09 3162.93 3163.84 3171.48 3172.22 3175.57 3175.94 3180.89 3185.49 3185.94 3186.90 3209.27 3209.92 3210.28 3220.06 3220.69 3229.32 3230.36 3231.37 3232.35 3264.17
formula: C40H60FeNO2P3
InChI: InChI=1/C39H60NP3.CO2.Fe/c1-25(2)41(26(3)4)37-22-31(13)16-19-34(37)40(35-20-17-32(14)23-38(35)42(27(5)6)28(7)8)36-21-18-33(15)24-39(36)43(29(9)10)30(11)12;2-1-3;/h16-30H,1-15H3;;/q;-1;+1/rC40H60FeNO2P3/c1-25(2)45(26(3)4)37-22-31(13)16-19-34(37)42-35-20-17-32(14)23-38(35)46(27(5)6,28(7)8)41(45,40(43)44-41)47(29(9)10,30(11)12)39-24-33(15)18-21-36(39)42/h16-30H,1-15H3
107 atoms
Fe -0.016807 0.019586 0.110718
P  -0.603076 -2.124658 -0.640715
P  -1.616806 1.558543 -0.595271
P  1.968207 0.684093 -1.017277
N  -0.297127 -0.06206 -2.858741
C  0.273346 -1.322535 -3.19058
C  0.98275 -1.482339 -4.383837
H  1.124989 -0.62392 -5.038742
C  1.495321 -2.72478 -4.745158
H  2.051473 -2.825913 -5.678119
C  1.282008 -3.846246 -3.938011
C  0.58244 -3.665327 -2.73897
H  0.43631 -4.537491 -2.102544
C  0.101322 -2.419074 -2.324244
C  1.772037 -5.209155 -4.339021
H  0.94545 -5.827857 -4.721078
H  2.208876 -5.745944 -3.485741
H  2.529997 -5.145284 -5.130187
C  -1.711811 0.043316 -2.982328
C  -2.379931 -0.65546 -3.991819
H  -1.815137 -1.325123 -4.639098
C  -3.749392 -0.500417 -4.177846
H  -4.252471 -1.065718 -4.963661
C  -4.478231 0.392729 -3.385749
C  -3.796052 1.074117 -2.371191
H  -4.375689 1.745904 -1.74034
C  -2.430635 0.892264 -2.118112
C  -5.944889 0.623591 -3.617166
H  -6.10475 1.381727 -4.399613
H  -6.443066 0.981895 -2.706931
H  -6.447732 -0.294901 -3.947931
C  0.410673 1.093718 -3.296673
C  -0.057368 1.828003 -4.392997
H  -0.945765 1.486512 -4.921994
C  0.580702 2.995143 -4.792922
H  0.190666 3.557404 -5.642459
C  1.716218 3.45347 -4.113782
C  2.179514 2.701339 -3.030639
H  3.045208 3.080638 -2.495661
C  1.547523 1.528325 -2.595062
C  2.410913 4.717647 -4.534554
H  3.207217 4.990115 -3.830228
H  1.705039 5.558463 -4.594289
H  2.865026 4.607159 -5.530595
C  0.061946 -3.604378 0.308755
H  -0.305702 -4.505089 -0.206274
C  1.588544 -3.60439 0.315186
H  1.957576 -2.758628 0.908383
H  2.038435 -3.537817 -0.682104
H  1.956071 -4.527604 0.788114
C  -0.407394 -3.664609 1.763688
H  0.017704 -4.566242 2.230444
H  -1.492679 -3.714705 1.874909
H  -0.048648 -2.796766 2.330438
C  -2.424429 -2.51725 -0.938524
H  -2.775219 -1.591219 -1.41265
C  -2.671118 -3.669919 -1.905032
H  -2.2559 -4.615833 -1.525758
H  -2.239247 -3.48168 -2.895679
H  -3.755032 -3.815468 -2.033647
C  -3.228968 -2.702198 0.346928
H  -4.293146 -2.516816 0.137354
H  -2.910636 -2.016305 1.141083
H  -3.149003 -3.732686 0.719345
C  -3.094304 1.971929 0.478609
H  -3.707685 2.684179 -0.092681
C  -3.934279 0.742877 0.816138
H  -3.378689 0.089237 1.497149
H  -4.214926 0.157793 -0.068027
H  -4.862763 1.062831 1.314908
C  -2.649472 2.668179 1.764981
H  -3.518475 2.795969 2.428022
H  -2.229256 3.663125 1.582307
H  -1.905977 2.068527 2.307715
C  -1.026712 3.251649 -1.170368
H  -0.378507 2.98102 -2.011406
C  -2.115789 4.17278 -1.704689
H  -2.784565 4.523552 -0.905763
H  -2.726593 3.681347 -2.474654
H  -1.65831 5.063573 -2.162597
C  -0.147037 3.945451 -0.129439
H  0.562561 4.622676 -0.627335
H  0.433984 3.228105 0.466115
H  -0.738122 4.551791 0.568932
C  2.996304 1.986287 -0.127391
H  2.434129 2.903482 -0.357257
C  4.447369 2.207308 -0.561103
H  4.808619 3.14925 -0.120777
H  4.588821 2.276435 -1.644814
H  5.105015 1.410104 -0.194955
C  2.933958 1.78863 1.38686
H  3.488765 0.892945 1.699101
H  1.905242 1.674283 1.747388
H  3.392102 2.654527 1.888628
C  3.129999 -0.707333 -1.514801
H  2.421173 -1.50491 -1.774536
C  3.997971 -0.450483 -2.740694
H  4.76281 0.314652 -2.557177
H  3.398821 -0.135132 -3.604236
H  4.518803 -1.379673 -3.019258
C  3.95121 -1.192619 -0.320979
H  4.336921 -2.202486 -0.523253
H  3.360157 -1.243801 0.601816
H  4.814131 -0.543934 -0.13015
C  -0.756841 -0.351485 1.816109
O  -1.672871 -0.630171 2.581465
O  0.481873 -0.15548 2.064506
elementType: Fe P N C H O
totalener: -4061.27922043 hartree
nucrepener: 8997.71763000 hartree
cpcmener: -0.03762397 hartree
kineticenergy: 4127.77662346 hartree
exchangeener: -280.386140725316 hartree
correlationener: -13.713820363566 hartree
xcener: -294.099961088882 hartree
s2: 2.180404
dispersion: -0.190982202 hartree
s2: 2.180321
dispersion: -0.190950622 hartree
s2: 2.180317
dispersion: -0.190931685 hartree
s2: 2.180008
dispersion: -0.190948906 hartree
s2: 2.180409
dispersion: -0.190951031 hartree
s2: 2.178229
dispersion: -0.190748692 hartree
s2: 2.179614
dispersion: -0.191152423 hartree
s2: 2.180154
dispersion: -0.190728006 hartree
s2: 2.180872
dispersion: -0.190606450 hartree
s2: 2.178040
dispersion: -0.191373518 hartree
s2: 2.179455
dispersion: -0.191044037 hartree
s2: 2.182387
dispersion: -0.190346870 hartree
s2: 2.180283
dispersion: -0.190753723 hartree
s2: 2.179250
dispersion: -0.191288883 hartree
s2: 2.179869
dispersion: -0.190941850 hartree
s2: 2.180272
dispersion: -0.190869966 hartree
s2: 2.180037
dispersion: -0.190928149 hartree
s2: 2.179710
dispersion: -0.190863388 hartree
s2: 2.179925
dispersion: -0.190960734 hartree
s2: 2.180153
dispersion: -0.190858419 hartree
s2: 2.179974
dispersion: -0.190922652 hartree
s2: 2.179972
chargesum: -0.0000000
charge: -0.368116 0.497649 0.481129 0.480459 -0.372941 0.107701 -0.185614 0.186134 -0.224422 0.172939 0.058960 -0.293297 0.177125 -0.111552 -0.484415 0.197687 0.191664 0.188471 0.070021 -0.175921 0.188445 -0.219287 0.173847 0.055568 -0.303688 0.181402 -0.072012 -0.483552 0.198504 0.190099 0.190217 0.073375 -0.171081 0.186401 -0.218334 0.175496 0.065282 -0.303781 0.179322 -0.088277 -0.487484 0.190471 0.194082 0.196918 -0.430292 0.212889 -0.505800 0.194376 0.206594 0.181551 -0.469021 0.175422 0.181257 0.185663 -0.436908 0.246314 -0.465483 0.178544 0.192508 0.175933 -0.508506 0.176005 0.212840 0.184191 -0.433061 0.212547 -0.511983 0.208378 0.194486 0.169003 -0.478162 0.177272 0.184399 0.189257 -0.433745 0.253861 -0.471357 0.183928 0.184883 0.178935 -0.500915 0.184451 0.211572 0.188863 -0.469581 0.226262 -0.481460 0.182132 0.203723 0.188644 -0.490139 0.178850 0.228703 0.175078 -0.447735 0.250031 -0.457572 0.180220 0.192528 0.175331 -0.494136 0.186486 0.208556 0.186626 0.402728 -0.373019 -0.418538
charge: -1.509587 0.876412 0.881826 0.855829 -0.005272 0.000562 -0.155764 0.161262 -0.141807 0.157001 -0.059127 -0.138964 0.153595 -0.167571 -0.386210 0.159042 0.154792 0.151532 0.002446 -0.155163 0.162282 -0.138821 0.157692 -0.058690 -0.142063 0.154608 -0.163376 -0.385774 0.159507 0.152509 0.153995 -0.002896 -0.153639 0.163223 -0.138211 0.158429 -0.055777 -0.147371 0.155401 -0.167781 -0.385842 0.151351 0.157159 0.158880 -0.286303 0.145776 -0.396313 0.144776 0.139913 0.145526 -0.396221 0.142853 0.141257 0.142878 -0.285280 0.154990 -0.398892 0.138554 0.139634 0.142632 -0.405133 0.141035 0.144367 0.137123 -0.288904 0.143064 -0.413638 0.148916 0.136297 0.139397 -0.396233 0.144029 0.139273 0.144476 -0.293101 0.158670 -0.398974 0.140304 0.140471 0.144199 -0.395805 0.144239 0.145533 0.140540 -0.291781 0.153230 -0.400263 0.147833 0.139851 0.141828 -0.394617 0.140340 0.153347 0.141591 -0.286095 0.155539 -0.397878 0.140088 0.140499 0.143727 -0.394777 0.146365 0.143647 0.139821 0.120273 -0.280871 -0.137248
qa: -0.3681 0.4976 0.4811 0.4805 -0.3729 0.1077 -0.1856 0.1861 -0.2244 0.1729 0.0590 -0.2933 0.1771 -0.1116 -0.4844 0.1977 0.1917 0.1885 0.0700 -0.1759 0.1884 -0.2193 0.1738 0.0556 -0.3037 0.1814 -0.0720 -0.4836 0.1985 0.1901 0.1902 0.0734 -0.1711 0.1864 -0.2183 0.1755 0.0653 -0.3038 0.1793 -0.0883 -0.4875 0.1905 0.1941 0.1969 -0.4303 0.2129 -0.5058 0.1944 0.2066 0.1816 -0.4690 0.1754 0.1813 0.1857 -0.4369 0.2463 -0.4655 0.1785 0.1925 0.1759 -0.5085 0.1760 0.2128 0.1842 -0.4331 0.2125 -0.5120 0.2084 0.1945 0.1690 -0.4782 0.1773 0.1844 0.1893 -0.4337 0.2539 -0.4714 0.1839 0.1849 0.1789 -0.5009 0.1845 0.2116 0.1889 -0.4696 0.2263 -0.4815 0.1821 0.2037 0.1886 -0.4901 0.1788 0.2287 0.1751 -0.4477 0.2500 -0.4576 0.1802 0.1925 0.1753 -0.4941 0.1865 0.2086 0.1866 0.4027 -0.3730 -0.4185
va: 5.7237 3.7683 3.7921 3.7225 3.0907 3.9969 3.7935 0.9385 3.8368 0.9419 3.8966 3.8645 0.9432 3.8221 3.8178 0.9220 0.9275 0.9329 4.0155 3.7913 0.9368 3.8245 0.9408 3.8997 3.8954 0.9432 3.8211 3.8174 0.9217 0.9316 0.9294 4.0069 3.7914 0.9377 3.8127 0.9396 3.8992 3.8914 0.9476 3.8325 3.8183 0.9340 0.9252 0.9231 3.9269 0.9056 3.7799 0.9442 0.9277 0.9310 3.8028 0.9316 0.9470 0.9542 3.9190 0.8729 3.8064 0.9353 0.9304 0.9327 3.7773 0.9295 0.9654 0.9254 3.9340 0.9058 3.7492 0.9773 0.9295 0.9328 3.8040 0.9334 0.9382 0.9479 3.8943 0.8645 3.8193 0.9313 0.9360 0.9298 3.8006 0.9274 0.9296 0.9331 3.9282 0.9003 3.7894 0.9298 0.9249 0.9381 3.8048 0.9361 0.9295 0.9304 3.9265 0.8734 3.8034 0.9385 0.9322 0.9335 3.7913 0.9282 0.9300 0.9375 3.9304 2.1605 2.1032
dispersion: -0.190946949 hartree
energy: -4061.500541639761 hartree
dipole: 5.00095 -4.07211 0.92884 1.67219 -0.95044 0.72175 -3.14908 -2.37599 -5.52507
magnitude: 5.64890 au
magnitude: 14.35836 debye
temp: 298.15 k
press: 1.00 atm
zeropoint: 0.92594864 hartree
thermalvibcorrection: 0.05267094 hartree
thermalrotcorrection: 0.00141627 hartree
thermaltrasncorrection: 0.00141627 hartree
thermaltotal: -4060.51908952 hartree
thermalcorr: 0.05550348 hartree
nonthermalcorr: 0.92594864 hartree
totalcorr: 0.98145212 hartree
thermalcorrenthalpy: 0.00094421 hartree
totalenthalpy: -4060.51814531 hartree
vibrat: 0.09446833 hartree
rotat: 0.01814537 hartree
transl: 0.02169762 hartree
total: 0.13534861 hartree
totalentropycorr: -0.13534861 hartree
gibbsenthalpy: -4060.65349391 hartree
gibbsminuselec: 0.84704773 hartree
