program: Orca
programVersion: 5.0.4
elementType: Fe P P P N C C H C H C C H C C H H H C C H C H C C H C C H H H C C H C H C C H C C H H H C H C H H H C H H H C H C H H H C H H H C H C H H H C H H H C H C H H H C H H H C H C H H H C H H H C H C H H H C H H H C O O H H
keywords: PBE0 D4 DKH2 RIJCOSX DKH-def2-SV(P) def2-tzvp/c Opt Freq UNO UCO NormalPrint CPCM(acetonitrile)
charge: 2
multiplicity: 3
frequency: 0.00 0.00 0.00 0.00 0.00 0.00 24.71 26.86 29.20 34.71 35.79 38.36 44.95 48.98 54.03 58.60 62.80 68.54 73.55 77.89 82.42 84.38 91.35 91.74 95.90 97.04 99.06 104.18 105.83 111.68 116.35 118.14 124.77 131.55 140.04 145.13 147.34 152.28 153.98 161.23 172.79 177.68 184.48 192.27 196.88 201.70 207.97 213.29 221.65 223.29 224.95 227.11 230.94 239.49 243.16 246.48 249.55 253.26 259.13 261.46 264.76 265.01 268.40 271.33 274.40 281.43 290.26 298.08 308.83 310.51 322.43 324.25 326.60 337.45 351.23 357.19 360.93 363.67 370.64 373.57 385.74 385.97 394.30 407.23 410.89 424.27 434.42 444.96 449.07 472.56 477.64 481.68 487.52 490.54 496.60 500.92 508.10 528.14 543.91 547.56 550.96 561.66 574.92 579.38 590.26 591.43 592.53 616.60 625.66 629.70 675.60 679.80 691.95 703.54 706.04 708.73 743.79 766.36 767.97 801.65 838.40 840.69 868.04 881.56 882.99 908.87 916.11 917.62 918.80 919.64 924.38 924.71 926.97 931.71 940.41 941.41 943.54 947.59 947.67 948.44 954.18 956.45 959.02 983.46 984.06 985.38 987.01 989.02 989.29 1000.57 1001.34 1002.11 1027.10 1027.76 1027.96 1052.63 1056.90 1058.92 1065.31 1066.20 1066.75 1073.64 1077.73 1082.60 1087.15 1094.56 1096.98 1133.00 1145.86 1146.72 1148.73 1151.57 1152.33 1182.04 1183.01 1183.23 1191.99 1193.30 1194.79 1194.85 1197.33 1197.54 1215.02 1234.32 1240.84 1267.52 1271.22 1274.23 1284.61 1289.90 1291.36 1296.66 1297.59 1314.17 1315.30 1317.33 1320.93 1331.65 1332.00 1338.53 1344.84 1344.94 1347.33 1388.28 1396.73 1397.54 1406.35 1408.95 1410.04 1412.77 1412.88 1413.00 1413.33 1414.11 1414.42 1421.89 1423.73 1424.73 1429.54 1430.91 1433.30 1442.11 1443.13 1443.86 1474.04 1475.65 1475.94 1477.65 1478.32 1479.21 1481.44 1482.46 1482.84 1484.02 1484.43 1484.78 1486.14 1488.12 1489.60 1490.39 1490.66 1491.14 1494.01 1495.52 1496.92 1497.18 1497.46 1500.12 1502.40 1505.57 1508.28 1509.45 1511.96 1516.59 1535.76 1538.31 1545.40 1657.61 1661.76 1663.25 1669.00 1683.61 1684.16 1686.80 2085.16 3060.26 3061.18 3061.51 3062.08 3062.17 3066.93 3068.46 3069.02 3070.79 3072.77 3072.80 3077.86 3079.13 3079.49 3080.61 3088.00 3089.45 3093.56 3098.06 3116.78 3118.14 3145.62 3145.94 3146.11 3146.75 3148.67 3154.56 3154.90 3155.37 3155.89 3157.14 3160.81 3163.29 3165.21 3167.05 3167.13 3174.21 3174.75 3174.85 3176.16 3176.72 3177.27 3178.44 3181.50 3182.85 3184.98 3188.61 3193.66 3194.77 3198.16 3219.76 3223.65 3225.93 3226.04 3226.12 3226.83 3246.42 3248.98 3250.64 3252.01 3789.27 3880.15
frequency: 24.71 26.86 29.20 34.71 35.79 38.36 44.95 48.98 54.03 58.60 62.80 68.54 73.55 77.89 82.42 84.38 91.35 91.74 95.90 97.04 99.06 104.18 105.83 111.68 116.35 118.14 124.77 131.55 140.04 145.13 147.34 152.28 153.98 161.23 172.79 177.68 184.48 192.27 196.88 201.70 207.97 213.29 221.65 223.29 224.95 227.11 230.94 239.49 243.16 246.48 249.55 253.26 259.13 261.46 264.76 265.01 268.40 271.33 274.40 281.43 290.26 298.08 308.83 310.51 322.43 324.25 326.60 337.45 351.23 357.19 360.93 363.67 370.64 373.57 385.74 385.97 394.30 407.23 410.89 424.27 434.42 444.96 449.07 472.56 477.64 481.68 487.52 490.54 496.60 500.92 508.10 528.14 543.91 547.56 550.96 561.66 574.92 579.38 590.26 591.43 592.53 616.60 625.66 629.70 675.60 679.80 691.95 703.54 706.04 708.73 743.79 766.36 767.97 801.65 838.40 840.69 868.04 881.56 882.99 908.87 916.11 917.62 918.80 919.64 924.38 924.71 926.97 931.71 940.41 941.41 943.54 947.59 947.67 948.44 954.18 956.45 959.02 983.46 984.06 985.38 987.01 989.02 989.29 1000.57 1001.34 1002.11 1027.10 1027.76 1027.96 1052.63 1056.90 1058.92 1065.31 1066.20 1066.75 1073.64 1077.73 1082.60 1087.15 1094.56 1096.98 1133.00 1145.86 1146.72 1148.73 1151.57 1152.33 1182.04 1183.01 1183.23 1191.99 1193.30 1194.79 1194.85 1197.33 1197.54 1215.02 1234.32 1240.84 1267.52 1271.22 1274.23 1284.61 1289.90 1291.36 1296.66 1297.59 1314.17 1315.30 1317.33 1320.93 1331.65 1332.00 1338.53 1344.84 1344.94 1347.33 1388.28 1396.73 1397.54 1406.35 1408.95 1410.04 1412.77 1412.88 1413.00 1413.33 1414.11 1414.42 1421.89 1423.73 1424.73 1429.54 1430.91 1433.30 1442.11 1443.13 1443.86 1474.04 1475.65 1475.94 1477.65 1478.32 1479.21 1481.44 1482.46 1482.84 1484.02 1484.43 1484.78 1486.14 1488.12 1489.60 1490.39 1490.66 1491.14 1494.01 1495.52 1496.92 1497.18 1497.46 1500.12 1502.40 1505.57 1508.28 1509.45 1511.96 1516.59 1535.76 1538.31 1545.40 1657.61 1661.76 1663.25 1669.00 1683.61 1684.16 1686.80 2085.16 3060.26 3061.18 3061.51 3062.08 3062.17 3066.93 3068.46 3069.02 3070.79 3072.77 3072.80 3077.86 3079.13 3079.49 3080.61 3088.00 3089.45 3093.56 3098.06 3116.78 3118.14 3145.62 3145.94 3146.11 3146.75 3148.67 3154.56 3154.90 3155.37 3155.89 3157.14 3160.81 3163.29 3165.21 3167.05 3167.13 3174.21 3174.75 3174.85 3176.16 3176.72 3177.27 3178.44 3181.50 3182.85 3184.98 3188.61 3193.66 3194.77 3198.16 3219.76 3223.65 3225.93 3226.04 3226.12 3226.83 3246.42 3248.98 3250.64 3252.01 3789.27 3880.15
formula: C40H62FeNO2P3
InChI: InChI=1/C39H60NP3.CO.Fe.H2O/c1-25(2)41(26(3)4)37-22-31(13)16-19-34(37)40(35-20-17-32(14)23-38(35)42(27(5)6)28(7)8)36-21-18-33(15)24-39(36)43(29(9)10)30(11)12;1-2;;/h16-30H,1-15H3;;;1H2/rC40H60FeNOP3.H2O/c1-26(2)44(27(3)4)38-22-32(13)16-19-35(38)42-36-20-17-33(14)23-39(36)45(28(5)6,29(7)8)41(42,44,25-43)46(30(9)10,31(11)12)40-24-34(15)18-21-37(40)42;/h16-24,26-31H,1-15H3;1H2
109 atoms
Fe -0.138863 0.078288 -0.61297
P  -0.821716 -2.166647 -0.63617
P  -1.742475 1.765273 -0.748313
P  2.055111 0.753133 -1.061846
N  -0.338556 -0.042213 -2.646714
C  0.217754 -1.335321 -3.064264
C  0.915713 -1.471177 -4.259365
H  1.103843 -0.607601 -4.893128
C  1.376627 -2.726644 -4.650542
H  1.933799 -2.816774 -5.583043
C  1.127581 -3.867265 -3.88062
C  0.427207 -3.706046 -2.679225
H  0.235179 -4.584463 -2.063346
C  -0.010521 -2.452666 -2.2488
C  1.577971 -5.226442 -4.328362
H  0.754516 -5.757893 -4.829409
H  1.895148 -5.843441 -3.477783
H  2.409369 -5.15693 -5.04054
C  -1.782827 0.039765 -2.914211
C  -2.367485 -0.708956 -3.929908
H  -1.767281 -1.3884 -4.531466
C  -3.735311 -0.599801 -4.170921
H  -4.182217 -1.204528 -4.960072
C  -4.54044 0.263931 -3.420948
C  -3.931448 1.012056 -2.405698
H  -4.552995 1.671376 -1.800287
C  -2.565252 0.910136 -2.137836
C  -6.007235 0.401586 -3.703083
H  -6.179201 1.178953 -4.463314
H  -6.562839 0.693236 -2.803093
H  -6.429312 -0.534541 -4.089645
C  0.384875 1.082032 -3.252226
C  -0.095974 1.701141 -4.402568
H  -1.023653 1.367301 -4.862162
C  0.600727 2.771174 -4.956017
H  0.203799 3.257686 -5.847097
C  1.790437 3.234889 -4.383161
C  2.257698 2.592863 -3.231307
H  3.170067 2.965745 -2.770815
C  1.572956 1.520109 -2.653332
C  2.548178 4.378771 -4.989949
H  3.254304 4.81721 -4.274163
H  1.867171 5.166616 -5.337435
H  3.124849 4.037579 -5.862946
C  -0.11719 -3.438903 0.522376
H  -0.557935 -4.393474 0.193211
C  1.403789 -3.510298 0.431667
H  1.845373 -2.557856 0.747291
H  1.780713 -3.748043 -0.568657
H  1.764962 -4.286368 1.121613
C  -0.512003 -3.178277 1.979325
H  -0.275948 -4.075226 2.569067
H  -1.572011 -2.955594 2.126863
H  0.074064 -2.352305 2.398401
C  -2.628299 -2.585009 -0.929956
H  -3.03771 -1.659849 -1.358156
C  -2.79614 -3.708023 -1.94944
H  -2.345651 -4.647577 -1.598464
H  -2.364615 -3.460507 -2.926115
H  -3.87117 -3.888505 -2.094995
C  -3.393954 -2.904119 0.350674
H  -4.462696 -2.974163 0.10331
H  -3.283181 -2.135006 1.12285
H  -3.088157 -3.872066 0.769231
C  -3.040623 1.986953 0.551653
H  -3.857546 2.546847 0.071789
C  -3.566158 0.630079 1.006917
H  -2.779989 0.040703 1.497064
H  -3.975517 0.040315 0.17785
H  -4.37282 0.78109 1.738209
C  -2.518264 2.808309 1.730454
H  -3.271741 2.795117 2.530445
H  -2.343497 3.85573 1.462892
H  -1.588236 2.39605 2.145207
C  -1.248536 3.431919 -1.414839
H  -0.667664 3.161299 -2.307005
C  -2.452684 4.254133 -1.860767
H  -3.08173 4.550011 -1.009892
H  -3.075816 3.716563 -2.587699
H  -2.095913 5.174511 -2.345481
C  -0.328409 4.205475 -0.471315
H  0.223374 4.959847 -1.049062
H  0.406259 3.559894 0.023562
H  -0.89086 4.732386 0.308248
C  2.948598 2.113429 -0.147538
H  2.422951 3.006833 -0.515898
C  4.43352 2.271237 -0.480536
H  4.772377 3.237631 -0.080754
H  4.651266 2.266056 -1.554366
H  5.041191 1.491877 -0.007576
C  2.730641 2.035122 1.361711
H  3.079205 1.087498 1.79246
H  1.676067 2.169461 1.628889
H  3.294904 2.847863 1.841158
C  3.171696 -0.695459 -1.438091
H  2.446631 -1.490099 -1.666668
C  4.053539 -0.505044 -2.667227
H  4.809984 0.275812 -2.518501
H  3.466785 -0.252879 -3.559393
H  4.581281 -1.448278 -2.870724
C  3.966213 -1.126177 -0.204734
H  4.307862 -2.16108 -0.346464
H  3.385916 -1.091107 0.725955
H  4.857408 -0.503809 -0.065608
C  -0.010857 0.158023 1.122408
O  0.055408 0.211579 2.267947
O  2.779638 -1.025156 3.243994
H  1.898423 -0.664943 3.083429
H  2.730426 -1.942004 2.945495
elementType: Fe P N C H O
totalener: -4062.22115560 hartree
nucrepener: 9035.84415117 hartree
cpcmener: -0.20977284 hartree
kineticenergy: 4129.26196209 hartree
exchangeener: -280.575520742950 hartree
correlationener: -13.692992745285 hartree
xcener: -294.268513488234 hartree
s2: 2.053486
dispersion: -0.186184225 hartree
s2: 2.053489
chargesum: 2.0000000
charge: -0.495853 0.534868 0.534055 0.545551 -0.521113 0.148766 -0.181287 0.217852 -0.192053 0.193515 0.059270 -0.272531 0.204606 -0.106789 -0.482129 0.210651 0.200742 0.199068 0.131202 -0.179501 0.219566 -0.190039 0.194536 0.051610 -0.269490 0.202033 -0.082883 -0.481681 0.211659 0.199902 0.200370 0.113068 -0.178153 0.215355 -0.187018 0.194931 0.054875 -0.267303 0.199009 -0.081467 -0.483199 0.199414 0.201688 0.210450 -0.419855 0.243648 -0.516607 0.202288 0.218128 0.204874 -0.490319 0.201539 0.203101 0.189344 -0.440890 0.260120 -0.477785 0.199181 0.213365 0.200435 -0.499272 0.202260 0.223062 0.205214 -0.427645 0.247496 -0.525652 0.220133 0.219214 0.207255 -0.481813 0.201901 0.207380 0.197976 -0.434764 0.265472 -0.472191 0.200298 0.201951 0.201617 -0.498461 0.201540 0.224671 0.200782 -0.458072 0.251493 -0.490118 0.202027 0.217597 0.204145 -0.503073 0.197329 0.212347 0.198099 -0.445180 0.264546 -0.464611 0.197317 0.206752 0.196715 -0.507522 0.202558 0.203117 0.202085 0.472674 -0.100675 -0.712630 0.387053 0.390909
charge: -1.462464 0.913918 0.915426 0.916394 0.092073 0.023486 -0.138841 0.176764 -0.112761 0.169288 -0.033762 -0.117081 0.167679 -0.151144 -0.383517 0.167624 0.160216 0.158276 0.023371 -0.137827 0.177342 -0.112065 0.169939 -0.032351 -0.121669 0.167190 -0.147408 -0.383361 0.168297 0.159103 0.159909 0.017591 -0.140227 0.177217 -0.112453 0.169918 -0.032244 -0.122813 0.165620 -0.147863 -0.383456 0.157590 0.161569 0.167666 -0.278741 0.166267 -0.395483 0.146870 0.148368 0.158693 -0.397496 0.158809 0.148998 0.142974 -0.272323 0.162662 -0.395683 0.149665 0.147060 0.156860 -0.396285 0.157899 0.148283 0.150496 -0.281755 0.165807 -0.395390 0.151631 0.148210 0.159223 -0.395572 0.157801 0.149903 0.147687 -0.277622 0.167139 -0.396663 0.150305 0.148931 0.157985 -0.394049 0.157544 0.147985 0.149414 -0.282533 0.164811 -0.397171 0.159162 0.146394 0.150078 -0.399691 0.144132 0.146826 0.156239 -0.273365 0.166132 -0.395726 0.148423 0.146488 0.156226 -0.401379 0.157400 0.139398 0.148750 0.316279 0.026388 -0.603744 0.302014 0.321902
qa: -0.4959 0.5349 0.5341 0.5456 -0.5211 0.1488 -0.1813 0.2179 -0.1921 0.1935 0.0593 -0.2725 0.2046 -0.1068 -0.4821 0.2107 0.2007 0.1991 0.1312 -0.1795 0.2196 -0.1900 0.1945 0.0516 -0.2695 0.2020 -0.0829 -0.4817 0.2117 0.1999 0.2004 0.1131 -0.1782 0.2154 -0.1870 0.1949 0.0549 -0.2673 0.1990 -0.0815 -0.4832 0.1994 0.2017 0.2104 -0.4199 0.2436 -0.5166 0.2023 0.2181 0.2049 -0.4903 0.2015 0.2031 0.1893 -0.4409 0.2601 -0.4778 0.1992 0.2134 0.2004 -0.4993 0.2023 0.2231 0.2052 -0.4276 0.2475 -0.5257 0.2201 0.2192 0.2073 -0.4818 0.2019 0.2074 0.1980 -0.4348 0.2655 -0.4722 0.2003 0.2020 0.2016 -0.4985 0.2015 0.2247 0.2008 -0.4581 0.2515 -0.4901 0.2020 0.2176 0.2041 -0.5031 0.1973 0.2123 0.1981 -0.4452 0.2645 -0.4646 0.1973 0.2068 0.1967 -0.5075 0.2026 0.2031 0.2021 0.4727 -0.1007 -0.7126 0.3871 0.3909
va: 6.4494 3.8982 3.9226 3.9027 3.0436 3.8355 3.8299 0.9235 3.8381 0.9372 3.9130 3.8845 0.9358 3.8842 3.8125 0.9194 0.9267 0.9297 3.8415 3.8260 0.9230 3.8295 0.9365 3.9197 3.8973 0.9406 3.8801 3.8126 0.9192 0.9288 0.9279 3.8530 3.8249 0.9250 3.8238 0.9356 3.9253 3.8996 0.9449 3.8882 3.8133 0.9306 0.9257 0.9197 3.9096 0.8973 3.7690 0.9552 0.9235 0.9249 3.7796 0.9271 0.9383 0.9567 3.9232 0.8730 3.7786 0.9309 0.9216 0.9292 3.7930 0.9265 0.9180 0.9212 3.9268 0.8963 3.7871 0.9224 0.9205 0.9251 3.7840 0.9288 0.9323 0.9371 3.9134 0.8663 3.7932 0.9290 0.9291 0.9260 3.7804 0.9260 0.9254 0.9346 3.9167 0.8904 3.7806 0.9262 0.9241 0.9340 3.7780 0.9665 0.9243 0.9291 3.9256 0.8671 3.7846 0.9352 0.9265 0.9290 3.7451 0.9251 0.9777 0.9347 3.7508 2.4837 1.7861 0.8382 0.8262
dispersion: -0.186174504 hartree
energy: -4062.407340468455 hartree
dipole: 4.82153 -6.21099 -1.38946 -1.29877 0.87223 -0.42655 9.30807 -11.10272 -1.79465
magnitude: 2.30940 au
magnitude: 5.87002 debye
temp: 298.15 k
press: 1.00 atm
zeropoint: 0.94904727 hartree
thermalvibcorrection: 0.05500988 hartree
thermalrotcorrection: 0.00141627 hartree
thermaltrasncorrection: 0.00141627 hartree
thermaltotal: -4061.40045077 hartree
thermalcorr: 0.05784242 hartree
nonthermalcorr: 0.94904727 hartree
totalcorr: 1.00688970 hartree
thermalcorrenthalpy: 0.00094421 hartree
totalenthalpy: -4061.39950656 hartree
vibrat: 0.09872957 hartree
rotat: 0.01817724 hartree
transl: 0.02170150 hartree
total: 0.13964560 hartree
totalentropycorr: -0.13964560 hartree
gibbsenthalpy: -4061.53915216 hartree
gibbsminuselec: 0.86818831 hartree
