program: Orca
programVersion: 5.0.4
elementType: Fe P P P N C C C H C H C C H C H H H C H C H H H C H H H C H C H H H C H H H C C C H C H C C H C H H H C H C H H H C H H H C H C H H H C H H H C C C H C H C C H C H H H C H C H H H C H H H C H C H H H C H H H
keywords: PBE0 D4 DKH2 RIJCOSX DKH-def2-SV(P) def2-tzvp/c Opt Freq UNO UCO NormalPrint CPCM(acetonitrile)
charge: 0
multiplicity: 3
frequency: 0.00 0.00 0.00 0.00 0.00 0.00 26.14 27.53 31.53 37.54 38.23 41.90 46.04 54.14 60.00 67.01 71.16 76.11 78.25 78.70 85.56 89.64 89.80 92.59 98.74 102.82 109.92 112.69 116.89 118.61 124.77 139.12 143.82 144.76 149.45 151.70 170.24 181.13 184.24 192.32 196.59 200.38 206.62 208.53 215.37 219.85 222.13 225.79 230.63 233.31 242.47 245.54 247.88 251.03 257.57 260.69 264.24 266.34 272.20 279.43 282.36 288.12 290.60 300.44 318.65 321.84 330.24 344.41 350.53 357.83 363.38 366.59 374.55 380.74 384.96 394.90 398.85 408.46 427.37 430.89 444.40 450.54 458.42 468.14 475.26 480.65 483.92 490.13 505.68 517.65 523.61 543.06 554.20 557.85 587.23 592.52 598.05 601.27 626.08 647.62 668.98 670.51 678.72 687.12 699.18 701.23 705.29 726.29 763.76 768.11 821.19 830.96 840.63 868.20 872.48 894.56 900.81 906.59 913.43 918.45 919.68 921.33 921.47 926.27 929.06 931.48 932.13 934.17 936.46 940.48 945.26 946.62 949.09 976.92 978.34 979.41 981.53 982.44 984.73 986.45 987.06 1011.98 1020.61 1022.83 1038.42 1039.31 1040.25 1055.19 1060.22 1062.65 1064.27 1066.50 1070.12 1082.21 1089.30 1098.41 1122.74 1131.10 1141.74 1144.03 1144.25 1145.65 1152.85 1161.39 1167.58 1187.46 1189.19 1190.06 1192.47 1193.84 1194.05 1195.67 1240.59 1246.93 1253.01 1261.14 1270.91 1272.22 1273.15 1285.24 1290.00 1293.36 1294.66 1297.26 1305.92 1309.64 1329.92 1337.87 1343.74 1347.16 1347.57 1349.32 1375.37 1377.48 1385.70 1393.26 1396.61 1400.34 1401.05 1401.83 1403.62 1405.87 1407.33 1408.86 1410.46 1412.52 1412.91 1413.52 1415.02 1416.61 1419.52 1438.65 1439.39 1450.15 1468.42 1472.76 1474.08 1475.02 1475.13 1475.52 1476.50 1477.98 1479.08 1479.91 1480.63 1481.07 1482.59 1484.14 1484.32 1485.56 1485.77 1485.94 1487.52 1489.41 1490.07 1492.14 1493.59 1496.00 1496.97 1499.20 1500.67 1501.24 1505.68 1512.35 1527.66 1537.93 1566.52 1599.84 1633.13 1649.21 1675.25 1680.20 3038.01 3040.43 3043.40 3044.77 3045.05 3046.32 3048.61 3049.80 3050.90 3051.34 3052.93 3053.20 3055.41 3057.67 3058.46 3068.02 3072.58 3080.84 3090.02 3090.25 3103.34 3111.36 3123.35 3124.12 3125.58 3126.02 3126.74 3128.97 3131.24 3131.35 3133.04 3133.44 3133.70 3137.26 3140.68 3141.30 3145.75 3146.44 3147.73 3153.56 3159.64 3159.87 3160.18 3162.31 3165.75 3169.25 3172.06 3177.13 3178.25 3179.62 3199.66 3200.28 3205.37 3206.90 3211.35 3211.49 3214.73 3225.48 3229.05 3229.55
frequency: 26.14 27.53 31.53 37.54 38.23 41.90 46.04 54.14 60.00 67.01 71.16 76.11 78.25 78.70 85.56 89.64 89.80 92.59 98.74 102.82 109.92 112.69 116.89 118.61 124.77 139.12 143.82 144.76 149.45 151.70 170.24 181.13 184.24 192.32 196.59 200.38 206.62 208.53 215.37 219.85 222.13 225.79 230.63 233.31 242.47 245.54 247.88 251.03 257.57 260.69 264.24 266.34 272.20 279.43 282.36 288.12 290.60 300.44 318.65 321.84 330.24 344.41 350.53 357.83 363.38 366.59 374.55 380.74 384.96 394.90 398.85 408.46 427.37 430.89 444.40 450.54 458.42 468.14 475.26 480.65 483.92 490.13 505.68 517.65 523.61 543.06 554.20 557.85 587.23 592.52 598.05 601.27 626.08 647.62 668.98 670.51 678.72 687.12 699.18 701.23 705.29 726.29 763.76 768.11 821.19 830.96 840.63 868.20 872.48 894.56 900.81 906.59 913.43 918.45 919.68 921.33 921.47 926.27 929.06 931.48 932.13 934.17 936.46 940.48 945.26 946.62 949.09 976.92 978.34 979.41 981.53 982.44 984.73 986.45 987.06 1011.98 1020.61 1022.83 1038.42 1039.31 1040.25 1055.19 1060.22 1062.65 1064.27 1066.50 1070.12 1082.21 1089.30 1098.41 1122.74 1131.10 1141.74 1144.03 1144.25 1145.65 1152.85 1161.39 1167.58 1187.46 1189.19 1190.06 1192.47 1193.84 1194.05 1195.67 1240.59 1246.93 1253.01 1261.14 1270.91 1272.22 1273.15 1285.24 1290.00 1293.36 1294.66 1297.26 1305.92 1309.64 1329.92 1337.87 1343.74 1347.16 1347.57 1349.32 1375.37 1377.48 1385.70 1393.26 1396.61 1400.34 1401.05 1401.83 1403.62 1405.87 1407.33 1408.86 1410.46 1412.52 1412.91 1413.52 1415.02 1416.61 1419.52 1438.65 1439.39 1450.15 1468.42 1472.76 1474.08 1475.02 1475.13 1475.52 1476.50 1477.98 1479.08 1479.91 1480.63 1481.07 1482.59 1484.14 1484.32 1485.56 1485.77 1485.94 1487.52 1489.41 1490.07 1492.14 1493.59 1496.00 1496.97 1499.20 1500.67 1501.24 1505.68 1512.35 1527.66 1537.93 1566.52 1599.84 1633.13 1649.21 1675.25 1680.20 3038.01 3040.43 3043.40 3044.77 3045.05 3046.32 3048.61 3049.80 3050.90 3051.34 3052.93 3053.20 3055.41 3057.67 3058.46 3068.02 3072.58 3080.84 3090.02 3090.25 3103.34 3111.36 3123.35 3124.12 3125.58 3126.02 3126.74 3128.97 3131.24 3131.35 3133.04 3133.44 3133.70 3137.26 3140.68 3141.30 3145.75 3146.44 3147.73 3153.56 3159.64 3159.87 3160.18 3162.31 3165.75 3169.25 3172.06 3177.13 3178.25 3179.62 3199.66 3200.28 3205.37 3206.90 3211.35 3211.49 3214.73 3225.48 3229.05 3229.55
formula: C39H60FeNP3
InChI: InChI=1/C39H60NP3.Fe/c1-25(2)41(26(3)4)37-22-31(13)16-19-34(37)40(35-20-17-32(14)23-38(35)42(27(5)6)28(7)8)36-21-18-33(15)24-39(36)43(29(9)10)30(11)12;/h16-30H,1-15H3;/rC39H60FeNP3/c1-25(2)42(26(3)4)37-22-31(13)16-19-34(37)41-35-20-17-32(14)23-38(35)43(27(5)6,28(7)8)40(42)44(29(9)10,30(11)12)39-24-33(15)18-21-36(39)41/h16-30H,1-15H3
104 atoms
Fe -0.213184 -0.059584 0.407023
P  2.134145 -0.073482 0.620027
P  -1.141788 -2.071881 0.739276
P  -1.126681 1.995474 0.795994
N  0.005397 -0.120713 2.722799
C  2.160159 0.918256 2.167782
C  1.052774 0.815716 3.028477
C  0.97382 1.626915 4.159413
H  0.105936 1.541612 4.81248
C  1.982603 2.546384 4.441871
H  1.900014 3.179008 5.326895
C  3.105815 2.654647 3.615416
C  3.179811 1.816915 2.495031
H  4.059147 1.886865 1.854076
C  4.190291 3.657186 3.89417
H  4.056871 4.560492 3.278976
H  5.183379 3.250305 3.660193
H  4.184732 3.971958 4.945784
C  3.16716 -1.572938 1.146864
H  2.41486 -2.201638 1.646419
C  3.744539 -2.367495 -0.021098
H  3.004674 -2.57902 -0.801302
H  4.122189 -3.33316 0.348188
H  4.592777 -1.842235 -0.48237
C  4.267729 -1.253397 2.153228
H  4.996008 -0.535759 1.745998
H  4.816844 -2.17468 2.403406
H  3.86822 -0.838211 3.086075
C  3.227624 0.858584 -0.582011
H  4.271664 0.799254 -0.235028
C  2.799726 2.317782 -0.702435
H  1.775777 2.372446 -1.09563
H  3.461744 2.842522 -1.407881
H  2.816963 2.861582 0.248456
C  3.110304 0.220632 -1.970781
H  3.479293 -0.807918 -2.016505
H  3.686484 0.812282 -2.698158
H  2.060082 0.218346 -2.301596
C  -0.223289 -2.536983 2.266049
C  0.293623 -1.488991 3.0605
C  1.108574 -1.791049 4.154736
H  1.506275 -0.98106 4.764389
C  1.425381 -3.111587 4.464993
H  2.071196 -3.32052 5.319306
C  0.917382 -4.169523 3.702545
C  0.088559 -3.853661 2.618052
H  -0.302317 -4.675374 2.01737
C  1.272417 -5.596442 4.014337
H  2.262177 -5.855752 3.607339
H  0.545439 -6.294029 3.57841
H  1.31219 -5.773269 5.09792
C  -0.954062 -3.565917 -0.367138
H  -1.288412 -4.457529 0.183903
C  -1.824096 -3.414621 -1.613801
H  -2.895586 -3.462807 -1.386222
H  -1.600927 -4.223697 -2.325711
H  -1.627945 -2.458725 -2.123804
C  0.508206 -3.734889 -0.758919
H  0.853935 -2.866182 -1.337361
H  0.634756 -4.631209 -1.385491
H  1.163763 -3.837374 0.11529
C  -2.926473 -2.13975 1.335897
H  -2.865076 -1.544311 2.257674
C  -3.88247 -1.408482 0.399682
H  -3.476732 -0.422968 0.133053
H  -4.850931 -1.252856 0.899259
H  -4.075164 -1.967022 -0.526613
C  -3.416143 -3.536376 1.699235
H  -3.53807 -4.172316 0.810394
H  -4.39812 -3.475181 2.193533
H  -2.729318 -4.045592 2.390021
C  -1.993053 1.242711 2.190195
C  -1.327326 0.321562 3.066932
C  -1.975413 -0.222278 4.16252
H  -1.435982 -0.931016 4.791445
C  -3.322224 0.076482 4.443718
H  -3.814176 -0.362513 5.312004
C  -4.021878 0.957406 3.58856
C  -3.357415 1.531244 2.513744
H  -3.922344 2.20469 1.871655
C  0.147239 4.537612 0.325107
H  0.604567 4.01275 -0.522288
H  0.894359 5.247993 0.712793
H  -0.690302 5.130199 -0.063592
C  -2.479834 2.511263 -0.400227
H  -3.197832 1.683376 -0.292001
C  -3.228678 3.820659 -0.15801
H  -3.627925 3.906478 0.859335
H  -4.079619 3.888001 -0.853937
H  -2.594113 4.69642 -0.339265
C  -1.931387 2.45681 -1.827165
H  -1.160834 3.222765 -1.996472
H  -2.739072 2.631423 -2.555148
H  -1.484131 1.475501 -2.04413
C  -0.288927 3.58176 1.431952
H  0.623648 3.159885 1.878888
C  -1.054971 4.293728 2.540518
H  -1.973057 4.767266 2.167726
H  -0.429945 5.084807 2.985758
H  -1.336413 3.597066 3.341365
C  -5.473755 1.259686 3.842709
H  -5.637703 1.610177 4.873309
H  -6.09686 0.36073 3.712572
H  -5.851767 2.030713 3.158209
elementType: Fe P N C H
totalener: -3872.88030638 hartree
nucrepener: 8039.48202573 hartree
twoeener: 9429.75951557 hartree
cpcmener: -0.01523307 hartree
kineticenergy: 3938.70000424 hartree
exchangeener: -264.222568065290 hartree
correlationener: -12.943753676026 hartree
xcener: -277.166321741315 hartree
s2: 2.832857
dispersion: -0.178556837 hartree
s2: 2.866360
dispersion: -0.178215843 hartree
s2: 2.896422
dispersion: -0.177421234 hartree
s2: 2.900705
dispersion: -0.178196882 hartree
s2: 2.895901
dispersion: -0.178380528 hartree
s2: 2.886052
dispersion: -0.177973600 hartree
s2: 2.889820
dispersion: -0.178011237 hartree
s2: 2.893487
dispersion: -0.178414680 hartree
s2: 2.884255
dispersion: -0.178180347 hartree
s2: 2.868413
dispersion: -0.178202640 hartree
s2: 2.869263
dispersion: -0.178201056 hartree
s2: 2.863077
dispersion: -0.178413007 hartree
s2: 2.843359
dispersion: -0.178201369 hartree
s2: 2.806326
dispersion: -0.178231587 hartree
s2: 2.782829
dispersion: -0.178007399 hartree
s2: 2.770887
dispersion: -0.178050600 hartree
s2: 2.756306
dispersion: -0.178085873 hartree
s2: 2.750491
dispersion: -0.178093818 hartree
s2: 2.750318
dispersion: -0.178300673 hartree
s2: 2.747365
dispersion: -0.178268533 hartree
s2: 2.744237
dispersion: -0.178276752 hartree
s2: 2.740718
dispersion: -0.178310215 hartree
s2: 2.740047
dispersion: -0.178329129 hartree
s2: 2.740463
dispersion: -0.178358710 hartree
s2: 2.743063
dispersion: -0.178367472 hartree
s2: 2.746333
dispersion: -0.178361956 hartree
s2: 2.750870
dispersion: -0.178347219 hartree
s2: 2.757585
dispersion: -0.178329261 hartree
s2: 2.767865
dispersion: -0.178310651 hartree
s2: 2.780794
dispersion: -0.178300992 hartree
s2: 2.792294
dispersion: -0.178305601 hartree
s2: 2.798152
dispersion: -0.178321812 hartree
s2: 2.800011
chargesum: 0.0000000
charge: -0.142499 0.454231 0.461393 0.426715 -0.456197 -0.088116 0.132772 -0.184931 0.177788 -0.232571 0.169938 0.059447 -0.311335 0.178397 -0.483583 0.196901 0.189698 0.187104 -0.434458 0.239285 -0.495199 0.202880 0.180034 0.187365 -0.464359 0.176644 0.174750 0.193498 -0.412677 0.206172 -0.510017 0.198527 0.181289 0.202748 -0.484058 0.186825 0.180973 0.188974 -0.071485 0.124936 -0.195156 0.181330 -0.228539 0.168157 0.049825 -0.315122 0.172708 -0.484494 0.195122 0.187384 0.187619 -0.416211 0.208534 -0.479893 0.194752 0.180207 0.182026 -0.507371 0.199441 0.179866 0.202820 -0.425640 0.251933 -0.497025 0.230454 0.169225 0.168787 -0.470468 0.178005 0.175020 0.180384 -0.146230 0.105950 -0.214971 0.160503 -0.309780 0.138163 0.078005 -0.343260 0.144115 -0.490083 0.193288 0.172116 0.178297 -0.462312 0.226442 -0.471480 0.196225 0.174280 0.180612 -0.479223 0.178663 0.174690 0.199785 -0.424176 0.229183 -0.460859 0.169964 0.166020 0.184665 -0.493685 0.176848 0.179877 0.176889
charge: -1.308557 0.827994 0.851414 0.804705 0.044160 -0.144697 0.018763 -0.154983 0.159657 -0.147944 0.155205 -0.059452 -0.144816 0.153028 -0.386125 0.158453 0.153503 0.151278 -0.291405 0.152818 -0.398644 0.140138 0.144141 0.140342 -0.398317 0.138501 0.141140 0.140073 -0.293808 0.146017 -0.398281 0.141570 0.144374 0.140324 -0.398431 0.141956 0.144401 0.144508 -0.151031 0.017365 -0.160866 0.159218 -0.148826 0.154525 -0.065991 -0.152022 0.150586 -0.386657 0.157310 0.150629 0.152648 -0.296415 0.144610 -0.396895 0.140228 0.144185 0.141410 -0.397636 0.143453 0.142666 0.140530 -0.292032 0.163205 -0.397153 0.142981 0.139072 0.133506 -0.400035 0.138049 0.141835 0.138956 -0.197667 -0.002427 -0.184503 0.149306 -0.245488 0.138396 -0.070956 -0.199243 0.138438 -0.400247 0.138215 0.140700 0.135897 -0.291375 0.151158 -0.399816 0.138121 0.142854 0.138514 -0.394120 0.139375 0.139846 0.145735 -0.306347 0.149588 -0.399706 0.136242 0.136890 0.139046 -0.387872 0.146091 0.147611 0.143334
qa: -0.1425 0.4542 0.4614 0.4267 -0.4562 -0.0881 0.1328 -0.1849 0.1778 -0.2326 0.1699 0.0594 -0.3113 0.1784 -0.4836 0.1969 0.1897 0.1871 -0.4345 0.2393 -0.4952 0.2029 0.1800 0.1874 -0.4644 0.1766 0.1748 0.1935 -0.4127 0.2062 -0.5100 0.1985 0.1813 0.2027 -0.4841 0.1868 0.1810 0.1890 -0.0715 0.1249 -0.1952 0.1813 -0.2285 0.1682 0.0498 -0.3151 0.1727 -0.4845 0.1951 0.1874 0.1876 -0.4162 0.2085 -0.4799 0.1948 0.1802 0.1820 -0.5074 0.1994 0.1799 0.2028 -0.4256 0.2519 -0.4970 0.2305 0.1692 0.1688 -0.4705 0.1780 0.1750 0.1804 -0.1462 0.1059 -0.2150 0.1605 -0.3098 0.1382 0.0780 -0.3433 0.1441 -0.4901 0.1933 0.1721 0.1783 -0.4623 0.2264 -0.4715 0.1962 0.1743 0.1806 -0.4792 0.1787 0.1747 0.1998 -0.4242 0.2292 -0.4609 0.1700 0.1660 0.1847 -0.4937 0.1768 0.1799 0.1769
va: 5.5463 3.6936 3.8679 3.8399 3.0405 3.8579 3.9626 3.8047 0.9494 3.8260 0.9425 3.8952 3.8721 0.9412 3.8196 0.9220 0.9287 0.9325 3.9137 0.8831 3.8110 0.9265 0.9299 0.9249 3.8000 0.9366 0.9332 0.9288 3.8962 0.9109 3.7874 0.9405 0.9300 0.9273 3.8000 0.9401 0.9320 0.9354 3.8570 3.9494 3.8081 0.9403 3.8216 0.9418 3.8967 3.8897 0.9470 3.8199 0.9221 0.9326 0.9290 3.9156 0.9100 3.8003 0.9320 0.9321 0.9384 3.8018 0.9286 0.9303 0.9263 3.8855 0.8812 3.7971 0.9388 0.9345 0.9395 3.8145 0.9335 0.9319 0.9373 3.8288 3.9091 3.8199 0.9432 3.7755 0.9478 3.9028 3.8878 0.9548 3.8044 0.9338 0.9311 0.9383 3.9083 0.9026 3.7983 0.9283 0.9313 0.9403 3.8093 0.9357 0.9316 0.9302 3.8534 0.8832 3.8087 0.9401 0.9334 0.9348 3.8274 0.9288 0.9263 0.9367
dispersion: -0.178335104 hartree
energy: -3873.066871902011 hartree
dipole: 0.80511 1.51524 2.32035 4.01403 -4.68678 -0.67275 -13.65624 12.82628 -0.82996
magnitude: 2.55450 au
magnitude: 6.49302 debye
temp: 298.15 k
press: 1.00 atm
zeropoint: 0.90693969 hartree
thermalvibcorrection: 0.05059198 hartree
thermalrotcorrection: 0.00141627 hartree
thermaltrasncorrection: 0.00141627 hartree
thermaltotal: -3872.10650769 hartree
thermalcorr: 0.05342452 hartree
nonthermalcorr: 0.90693969 hartree
totalcorr: 0.96036421 hartree
thermalcorrenthalpy: 0.00094421 hartree
totalenthalpy: -3872.10556348 hartree
vibrat: 0.09052118 hartree
rotat: 0.01804963 hartree
transl: 0.02161026 hartree
total: 0.13121836 hartree
totalentropycorr: -0.13121836 hartree
gibbsenthalpy: -3872.23678184 hartree
gibbsminuselec: 0.83009006 hartree
