program: Gaussian 09
title: 000075699
version: EM64L-G09RevD.01
frameworkgroup: C1[X(C12H22O2)]
method: RPBEPBE
basis: SDD
operation: Freq
keyword: #pfreq=noraman
keyword: PBEPBE/SDD
title: #p freq=noraman PBEPBE/SDD
converged: YES YES NO NO
title: Mulliken charges:
elementType: O O C C C C C C C C C C C C H H H H H H H H H H H H H H H H H H H H H H
charge: -0.289112 -0.256825 -0.037294 -0.086418 -0.479541 0.024797 -0.500401 -0.436739 -0.039214 -0.748735 -0.753040 -0.741418 0.293975 -0.759922 0.190134 0.272550 0.206144 0.214295 0.217285 0.231475 0.200178 0.198200 0.186362 0.220340 0.215541 0.214458 0.205950 0.206431 0.210491 0.244046 0.204447 0.211863 0.224693 0.244688 0.245277 0.245037
chargesum: 0.00000
title: Mulliken charges with hydrogens summed into heavy atoms:
elementType: O O C C C C C C C C C C C C
charge: -0.289112 -0.256825 0.152839 0.186132 -0.059102 0.242082 -0.068747 -0.052177 0.181126 -0.112785 -0.092071 -0.100416 0.293975 -0.024920
polarizability: 1.40616885e+02 -1.66434489e+00 1.40010210e+02 1.50677800e-03 -1.74066479e+00 1.17600057e+02
1716.lowfreq: -40.0761 -5.4782 -0.0004 0.0005 0.0007 5.9991 11.0992 25.6200 45.3732
frequency: -39.8869 25.5196 45.3531 66.8254 74.8126 104.1518 155.4445 186.2067 200.8559 213.1416 216.9607 229.4442 245.0015 298.0874 307.3880 319.7177 358.3275 410.0402 422.4065 428.2239 442.3844 502.3550 550.6722 569.7490 604.4982 651.4331 763.7001 784.5759 818.0404 859.3080 876.6581 890.5751 907.3081 915.4901 938.2892 953.0079 957.5640 983.8492 996.6917 1012.9232 1028.3020 1039.5011 1065.9020 1083.5914 1103.6746 1124.0846 1145.5519 1153.2623 1173.0973 1197.1506 1213.4224 1217.7682 1241.3073 1268.5355 1275.1636 1295.6500 1308.3162 1319.2500 1323.1047 1328.4732 1337.0678 1345.8426 1353.8692 1373.6987 1379.6142 1380.4501 1387.1368 1397.8398 1451.0422 1452.8827 1455.1261 1462.0494 1467.0326 1470.3250 1474.3400 1477.3548 1478.4657 1483.0137 1497.8541 1641.2921 2929.1311 2948.0512 2961.7260 2964.1484 2967.4322 2970.4094 2975.0745 2979.6957 2983.6489 3006.1512 3019.5905 3035.7046 3047.0946 3050.7610 3056.7182 3058.6261 3064.1043 3065.2476 3073.8989 3078.6250 3094.4915 3141.3392
redmass: 1.0950 7.3625 2.5377 2.8803 2.7812 2.9598 2.9134 3.1420 1.8630 1.2485 1.1866 1.8553 1.7016 2.3199 2.5842 2.8192 2.6330 2.1010 2.7416 2.2973 2.2357 2.6071 3.3481 3.5716 3.8878 3.6163 2.8201 2.3673 1.9726 2.6478 1.6904 3.2761 2.2521 1.2450 1.4805 1.7022 1.5611 1.8181 1.8388 1.8339 2.0773 1.6622 1.2753 1.8598 2.7720 2.0330 2.0446 2.1477 1.7924 2.2049 2.3883 1.4354 1.2980 1.3065 1.4583 1.3326 1.3071 1.4770 1.3219 1.3783 1.4063 1.7790 1.4478 1.4501 1.2202 1.2537 1.2491 1.2052 1.0857 1.0662 1.0478 1.0757 1.0806 1.0681 1.0473 1.0508 1.0544 1.0556 1.0477 9.0280 1.0807 1.0642 1.0631 1.0424 1.0369 1.0412 1.0747 1.0733 1.0699 1.0367 1.0963 1.0982 1.0885 1.0980 1.0984 1.0988 1.0992 1.0977 1.0988 1.0980 1.0973 1.1009
irintensity: 1.2113 1.6623 0.0536 0.8409 0.7760 0.6891 1.8369 3.8691 2.1513 0.1364 0.7551 1.2695 1.7752 0.1962 0.6310 2.3329 0.5725 0.0306 4.7302 0.3948 1.2311 0.4654 0.4474 4.7374 3.4993 5.0211 1.0474 6.3703 2.5856 3.3065 11.6880 18.6774 17.9036 14.4813 10.8881 17.0661 10.1283 25.8819 63.6280 6.5803 7.7727 7.4809 3.0709 2.8481 0.6607 0.1526 26.8011 17.3718 8.6831 170.2994 181.2229 7.7640 0.5111 1.3315 3.0035 0.2128 1.7259 1.6153 0.0378 1.7692 3.2328 1.9232 0.4314 8.0026 21.8198 57.7743 5.0868 18.0312 14.0989 18.4317 17.9291 11.2515 5.8492 0.4724 16.6608 1.0843 13.1031 6.3706 24.2366 176.8110 11.9251 28.5524 11.0049 40.9648 27.5676 24.7256 44.7709 19.8919 28.3218 3.2400 55.8841 20.9171 7.9926 48.6222 1.5047 76.3848 40.6082 95.2256 36.5854 44.6769 8.9345 11.6001
temp: 298.150 k
press: 1.00000 atm
elementType: 8 8 6 6 6 6 6 6 6 6 6 6 6 6 1 1 1 1 1 1 1 1 1 1 1 1 1 1 1 1 1 1 1 1 1 1
symmnumber: 1
zpe: 833976.9 jmol-1
zpe.correction: 0.317645 hartree
zpe.thermalcorrener: 0.333256 hartree
zpe.thermalcorrenthalpy: 0.334200 hartree
zpe.thermalcorrgfe: 0.274448 hartree
zpe.sumelectzpe: -619.803713 hartree
zpe.sumelectthermal: -619.788102 hartree
zpe.sumelectthermalent: -619.787158 hartree
zpe.sumelectthermalfe: -619.846910 hartree
dipole: 0.3849 -1.4082 1.6079
dipole: 2.1718
quadrupole: -86.6747 -90.2998 -87.8432
quadrupole: 0.9724 -1.9776 8.9420
quadrupole: 1.5979 -2.0272 0.4294 0.9724 -1.9776 8.9420
hfenergy: -620.1213578 hartree
pointgroup: C01 [X(C12H22O2)]
dipole: 0.2814718 0.5392101 0.6000677 debye
polarizability: 138.5511535|-0.097122|142.0292684|1.8432391|-0.7205433|117.6467307 unknown
InChI: InChI=1S/C12H22O2/c1-8(2)11-6-5-9(3)7-12(11)14-10(4)13/h8-9,11-12H,5-7H2,1-4H3
charge 0 multiplicity 1
36 atoms
O  -0.6632 -0.86633 0.53657
O  -1.624489 -2.477802 -0.856348
C  1.227542 0.48967 -0.23852
C  -0.124925 -0.125145 -0.6663
C  0.997428 1.616547 0.805066
C  -1.388051 2.033369 -0.050428
C  -1.166863 0.921241 -1.102102
C  -0.026065 2.669795 0.318497
C  2.256654 -0.584594 0.240106
C  -2.396099 3.085256 -0.55732
C  2.431432 -1.732566 -0.786247
C  3.638205 0.048048 0.543887
C  -1.404734 -2.023339 0.290956
C  -1.886483 -2.62587 1.595083
H  1.6411 0.957563 -1.161962
H  0.003853 -0.871282 -1.46976
H  1.955742 2.118261 1.031408
H  0.637538 1.159466 1.748653
H  -1.798817 1.557712 0.864779
H  -2.117395 0.408323 -1.34313
H  -0.805823 1.382316 -2.04609
H  -0.17081 3.442216 1.099699
H  0.377687 3.19269 -0.575568
H  1.861334 -1.021895 1.180132
H  -3.370894 2.624494 -0.805347
H  -2.575001 3.868296 0.203354
H  -2.017234 3.583854 -1.470962
H  2.742002 -1.337033 -1.773435
H  3.215744 -2.434365 -0.446727
H  1.506628 -2.31856 -0.93012
H  4.03868 0.567013 -0.349403
H  4.365708 -0.733592 0.831109
H  3.594986 0.778473 1.370687
H  -2.572887 -1.926136 2.103531
H  -1.034121 -2.800628 2.273756
H  -2.407572 -3.573264 1.395793
