program: Gaussian 16
title: COMMENT
version: EM64L-G16RevC.01
method: RB3PW91
basis: GenECP
operation: Freq
keyword: #PGeom=AllCheck
keyword: Guess=TCheck
keyword: SCRF=Check
keyword: GenChk
keyword: RB3PW91/GenECP
keyword: Freq
converged: YES YES YES YES
title: Mulliken charges:
elementType: C H H C N Li
charge: -0.521545 0.142287 0.142161 0.218697 -0.668477 0.686876
chargesum: -0.00000
title: Mulliken charges with hydrogens summed into heavy atoms:
elementType: C C N Li
charge: -0.237097 0.218697 -0.668477 0.686876
polarizability: 6.45336509e+01 -1.15185932e+01 3.84770377e+01 1.49179491e+01 -6.30813808e+00 4.19379320e+01
1716.lowfreq: -24.1541 0.0001 0.0006 0.0008 5.2073 25.2505 108.1627 345.0935 441.3726
frequency: 107.9542 345.0822 441.3702 491.5874 567.2977 786.3719 1034.8866 1093.5721 1416.3509 2215.0399 3079.7378 3144.8377
redmass: 7.4590 1.2844 2.9632 7.0947 3.4561 1.5108 4.8976 1.3587 1.1516 12.1428 1.0557 1.1064
irintensity: 89.9086 68.2220 43.9448 59.5147 39.1629 328.6971 51.0709 2.7870 13.5802 620.4426 6.1159 9.7272
temp: 298.150 k
press: 1.00000 atm
elementType: 6 1 1 6 7 3
symmnumber: 1
zpe: 88069.6 jmol-1
zpe.correction: 0.033544 hartree
zpe.thermalcorrener: 0.038291 hartree
zpe.thermalcorrenthalpy: 0.039235 hartree
zpe.thermalcorrgfe: 0.007051 hartree
zpe.sumelectzpe: -139.617830 hartree
zpe.sumelectthermal: -139.613083 hartree
zpe.sumelectthermalent: -139.612139 hartree
zpe.sumelectthermalfe: -139.644324 hartree
dipole: 11.3191 0.2595 -0.8887
dipole: 11.3569
quadrupole: -113.9830 -20.7059 -20.5667
quadrupole: 4.3564 -4.3778 0.6172
quadrupole: -62.2311 31.0460 31.1851 4.3564 -4.3778 0.6172
hfenergy: -139.6513741 hartree
pointgroup: C01 [X(C2H2Li1N1)]
dipole: 4.4532686 0.1021057 -0.3496547 debye
dipolederiv: -1.5323055 0.2431445 -0.2846126 0.1112415 -0.4096167 0.1901718 -0.1008144 0.1829941 -0.5291117 0.2386455 -0.1081092 -0.0848236 0.0648381 -0.1352159 0.0125315 -0.1892932 0.0624364 0.1011479 0.2480396 0.1079544 0.0598674 0.1491639 0.0864638 -0.0293647 -0.1400691 -0.0689491 -0.1305659 1.4560943 -0.494407 0.6317364 -0.7141266 0.2443814 -0.3688569 0.9423339 -0.3784727 0.455922 -1.3034726 0.2708139 -0.3494448 0.4096488 -0.6718463 0.1683968 -0.5445904 0.1742832 -0.761845 0.8929987 -0.0193966 0.0272773 -0.0207657 0.8858337 0.0271215 0.0324332 0.0277081 0.8644528 unknown
polarizability: 64.5336509|-11.5185932|38.4770377|14.9179491|-6.3081381|41.937932 unknown
InChI: InChI=1/C2H2N.Li/c1-2-3;/h1H2;/rC2H2LiN/c3-1-2-4/h1H2
charge 0 multiplicity 1
6 atoms
C  -3.92979014 -0.48266149 0.64336356
H  -3.86697664 -1.57585063 0.62709711
H  -3.81868756 -0.10188616 1.66413166
C  -5.10929289 -0.0132878 0.03125151
N  -6.04571381 0.4194403 -0.5392575
Li -2.37317787 0.27473334 -0.50324183
