program: Gaussian 16
title: COMMENT
version: EM64L-G16RevC.01
method: RB3PW91
basis: GenECP
operation: Freq
keyword: #P
keyword: Geom=AllCheck
keyword: Guess=TCheck
keyword: SCRF=Check
keyword: GenChk
keyword: RB3PW91/GenECP
keyword: Freq
converged: YES YES YES YES
title: Mulliken charges:
elementType: C C N H H K
charge: -0.756052 0.193684 -0.739543 0.167339 0.167546 0.967025
chargesum: -0.00000
title: Mulliken charges with hydrogens summed into heavy atoms:
elementType: C C N K
charge: -0.421166 0.193684 -0.739543 0.967025
chargesum: 0.00000
polarizability: 9.51079711e+01 -6.98371031e+00 3.25875699e+01 2.68762724e-01 -3.69772505e+00 4.31103613e+01
1716.lowfreq: -60.1143 -0.0039 -0.0024 0.0033 16.4182 23.3712 67.4609 73.8996 214.7718
frequency: 66.8067 72.9517 214.7546 217.4901 443.0021 583.7855 1008.5574 1145.8237 1411.5136 2127.4536 3177.1984 3269.5443
redmass: 5.7908 6.5025 12.2749 1.3023 2.8342 7.9808 1.6251 3.3224 1.3137 12.1540 1.0526 1.1178
irintensity: 24.0883 27.7972 75.4042 403.0143 6.1304 4.4502 2.2090 6.2824 29.7435 1602.7706 0.6079 3.1960
temp: 298.150 k
press: 1.00000 atm
elementType: 6 6 7 1 1 19
symmnumber: 1
zpe: 82176.8 jmol-1
zpe.correction: 0.031299 hartree
zpe.thermalcorrener: 0.037295 hartree
zpe.thermalcorrenthalpy: 0.038239 hartree
zpe.thermalcorrgfe: 0.001870 hartree
zpe.sumelectzpe: -731.949648 hartree
zpe.sumelectthermal: -731.943653 hartree
zpe.sumelectthermalent: -731.942709 hartree
zpe.sumelectthermalfe: -731.979077 hartree
dipole: -14.5185 1.7991 -0.1333
dipole: 14.6301
quadrupole: 169.3786 -27.4654 -32.6518
quadrupole: -17.2086 1.5043 1.1748
quadrupole: 132.9582 -63.8859 -69.0723 -17.2086 1.5043 1.1748
hfenergy: -731.9809476 hartree
pointgroup: C01 [X(C2H2K1N1)]
dipole: -5.7120098 0.7078118 -0.0524558 debye
dipolederiv: -1.6276132 0.150287 0.02914 0.1467647 -0.2436992 0.293503 0.0336936 0.2930599 -1.140394 3.2524392 -0.3614795 0.0376988 -0.3621055 0.0154361 -0.0392125 0.0435759 -0.0397998 0.0837823 -2.8247664 0.2404356 -0.0309121 0.2403067 -0.7000918 -0.020423 -0.037452 -0.0193847 -0.5995528 -0.0195151 -0.026079 -0.0282595 -0.05909 0.0016684 -0.116648 -0.0417306 -0.1158452 0.3530678 0.0015669 0.0299738 -0.010508 0.0656139 -0.0207286 -0.115646 -0.002908 -0.1160498 0.3567234 1.2178886 -0.0331379 0.0028408 -0.0314898 0.9474151 -0.0015735 0.004821 -0.0019805 0.9463732 unknown
polarizability: 95.1079711|-6.9837103|32.5875699|0.2687627|-3.697725|43.1103613 unknown
InChI: InChI=1/C2H2N.K/c1-2-3;/h1H2;/rC2H2KN/c1-2-4-3/h1H2
charge 0 multiplicity 1
6 atoms
C  -3.62329429 -0.04224614 0.01550939
C  -4.97642913 0.1071717 -0.00407958
N  -6.16484917 0.23908254 -0.02172279
H  -2.98486183 0.79016417 0.29272899
H  -3.17457054 -0.99727964 -0.2372821
K  -8.71968303 0.56533936 -0.0451599
