program: Gaussian 16
title: COMMENT
version: EM64L-G16RevC.01
method: RB3PW91
basis: GenECP
operation: Freq
keyword: #P
keyword: Geom=AllCheck
keyword: Guess=TCheck
keyword: SCRF=Check
keyword: GenChk
keyword: RB3PW91/GenECP
keyword: Freq
converged: YES YES YES YES
title: Mulliken charges:
elementType: C C N H H Li O C C C H H C H H H H H H
charge: -1.230241 0.236334 -0.108346 0.171835 0.171764 0.598775 -0.311045 -0.091214 -0.087339 -0.371668 0.162690 0.171236 -0.378843 0.160500 0.173153 0.186984 0.179503 0.179631 0.186290
chargesum: -0.00000
title: Mulliken charges with hydrogens summed into heavy atoms:
elementType: C C N Li O C C C C
charge: -0.886642 0.236334 -0.108346 0.598775 -0.311045 0.242713 0.246314 -0.005182 -0.012922
polarizability: 1.54968585e+02 -1.02824157e+01 8.50324853e+01 2.40986956e-01 6.52570453e-01 1.02847736e+02
1716.lowfreq: -4.2798 0.0003 0.0007 0.0008 8.6129 11.1447 22.6277 34.2681 45.2234
frequency: 20.0515 32.9366 44.8063 57.1777 74.4062 111.3246 165.1818 172.8284 196.3593 263.1004 314.1891 444.1216 572.0406 576.1899 622.6777 721.9926 865.7171 880.1364 905.6672 924.9035 942.9430 975.1498 1005.3701 1050.3411 1062.5838 1163.8539 1174.7275 1191.9673 1194.6282 1263.8388 1267.0167 1317.2999 1346.3836 1377.8278 1403.9065 1413.3911 1472.5808 1483.2167 1510.4102 1519.7364 2141.0981 3064.2912 3068.7429 3078.1576 3081.3794 3132.5145 3133.7094 3145.4897 3152.5250 3180.9462 3274.5725
redmass: 3.3558 3.9827 1.0686 3.3248 6.0028 3.0839 6.2547 6.3577 6.3158 1.6082 1.2959 2.8183 7.5254 1.7716 5.1628 2.9569 1.7140 1.9856 4.2411 1.5114 2.5443 1.5284 1.6419 1.5447 5.8408 1.7900 3.0288 1.2595 1.6067 1.1673 1.2170 1.3890 1.3352 1.3238 1.3436 1.3730 1.0955 1.1132 1.0899 1.1003 12.1398 1.0615 1.0634 1.0680 1.0616 1.1048 1.1035 1.1030 1.1067 1.0532 1.1179
irintensity: 2.0524 3.9823 0.5152 0.3251 13.0134 0.5251 73.2205 54.6417 82.3299 0.3150 368.8167 7.8562 2.7734 2.5584 147.7676 143.1031 24.9714 16.5078 142.0817 11.5435 6.2249 2.5869 2.7096 7.5993 180.9954 1.4167 0.7342 9.5529 20.5983 0.9885 9.0030 1.0718 1.6827 1.4633 3.5381 26.1413 9.0100 13.5100 1.2784 1.7898 1918.6649 115.7962 6.1344 15.0509 35.7712 50.5153 1.2424 13.9977 56.3399 3.2992 1.0198
temp: 298.150 k
press: 1.00000 atm
elementType: 6 6 7 1 1 3 8 6 6 6 1 1 6 1 1 1 1 1 1
symmnumber: 1
zpe: 398095.7 jmol-1
zpe.correction: 0.151627 hartree
zpe.thermalcorrener: 0.163487 hartree
zpe.thermalcorrenthalpy: 0.164431 hartree
zpe.thermalcorrgfe: 0.110641 hartree
zpe.sumelectzpe: -371.937785 hartree
zpe.sumelectthermal: -371.925925 hartree
zpe.sumelectthermalent: -371.924981 hartree
zpe.sumelectthermalfe: -371.978771 hartree
dipole: -14.0434 1.9260 -0.1324
dipole: 14.1755
quadrupole: 162.4341 -47.9448 -51.1449
quadrupole: -20.9915 1.2885 0.0339
quadrupole: 141.3193 -69.0596 -72.2597 -20.9915 1.2885 0.0339
hfenergy: -372.0894119 hartree
pointgroup: C01 [X(C6H10Li1N1O1)]
dipole: -5.5251112 0.757754 -0.0520798 debye
dipolederiv: -1.688395 0.2238468 -0.0061988 0.2230028 -0.1796791 -0.0195977 -0.0067183 -0.0167922 -1.1341575 3.4879936 -0.5078919 0.01542 -0.5082286 0.0612096 -0.0000188 0.0147326 -0.0015383 0.0888546 -3.1382282 0.3554905 -0.0117546 0.3561761 -0.7268561 0.0031187 -0.0119171 0.0033536 -0.5840797 -0.0050046 -0.0288503 0.0001837 -0.0570328 -0.0130879 0.0080951 0.0008679 0.007472 0.3712223 0.0185375 0.0191928 -0.0004264 0.0479721 -0.0357215 0.0083277 -0.0001926 0.0072349 0.3709624 1.5113027 -0.0948352 0.0063937 -0.0916336 0.8040012 -0.0007801 0.0072535 -0.0025063 0.7756093 -1.1936314 0.0868401 -0.0066297 0.0865827 -0.5241134 -0.1032399 -0.0155952 -0.1480967 -1.3337907 0.4787296 -0.0908501 -0.3245701 -0.0618855 0.4281219 0.1483457 -0.2137707 0.1074898 0.770895 0.4916218 0.0688744 0.341094 0.0386271 0.3928232 0.0680645 0.2228067 0.0572707 0.7877822 -0.0428537 0.0100356 0.0115908 0.0445482 0.1514888 -0.0037834 -0.0589407 0.0306544 0.0106812 0.0257079 0.050754 -0.0716906 0.0653305 -0.0154449 0.1172252 -0.0209925 0.0518326 -0.08503 0.0190045 -0.0513357 0.0057684 -0.0501091 -0.1482739 -0.1309293 0.015566 -0.046741 -0.0278244 -0.0465002 0.0436322 -0.015263 0.0094941 0.1483145 -0.0034971 0.0632437 0.0129481 0.0134409 -0.0125185 -0.0529514 0.1030061 -0.0713802 0.0200448 0.0883364 0.0381878 0.0407074 -0.0789273 0.0362547 0.001519 -0.0387333 0.0034244 -0.162039 -0.1219638 -0.0250639 -0.0367909 -0.0272376 -0.0092356 0.0484494 0.0883685 0.0746516 0.0480463 -0.0704411 0.1119732 -0.0487892 -0.0016475 0.0377899 -0.0436758 -0.0118911 -0.0851149 -0.1529094 0.0303487 -0.023658 0.0026099 0.0458273 0.0566105 -0.0130009 0.0201888 0.0248765 -0.1714522 0.0285746 0.0237698 -0.0014426 0.0479353 -0.0271856 -0.0252435 -0.1048563 -0.0493016 0.0755271 -0.0461854 -0.1215522 -0.0188763 -0.0105159 unknown
polarizability: 154.968585|-10.2824157|85.0324853|0.240987|0.6525705|102.8477359 unknown
InChI: InChI=1/C4H8O.C2H2N.Li/c1-2-4-5-3-1;1-2-3;/h1-4H2;1H2;/rC6H10LiNO/c1-2-8-7-9-5-3-4-6-9/h1,3-6H2
charge 0 multiplicity 1
19 atoms
C  -3.72805729 -0.05831595 0.01109327
C  -5.06802582 0.13660396 0.00552647
N  -6.25128923 0.30892091 0.00060349
H  -3.05260307 0.79041793 -0.00566753
H  -3.32299695 -1.0645241 0.0318585
Li -8.08521902 0.56686888 -0.01114851
O  -9.93553456 0.76019595 -0.03162753
C  -10.76959102 0.97563638 1.13645415
C  -10.75027275 0.75642794 -1.23266978
C  -12.19703921 0.80356277 0.64343067
H  -10.47407859 0.25368253 1.90271564
H  -10.58568445 1.9915279 1.50557053
C  -12.0991344 1.30527553 -0.79854323
H  -10.24489829 1.36499 -1.98779239
H  -10.82687406 -0.27668804 -1.59201274
H  -12.9093226 1.36839394 1.25017978
H  -12.48424744 -0.25347382 0.66273835
H  -12.09276375 2.40057786 -0.82375488
H  -12.91081742 0.94725487 -1.43691567
