program: Gaussian 16
title: COMMENT
version: EM64L-G16RevC.01
method: RB3PW91
basis: GenECP
operation: Freq
keyword: #P
keyword: Geom=AllCheck
keyword: Guess=TCheck
keyword: SCRF=Check
keyword: GenChk
keyword: RB3PW91/GenECP
keyword: Freq
converged: YES YES NO YES
title: Mulliken charges:
elementType: C H H C N Cu C H H H
charge: -1.235571 0.167428 0.167252 0.206779 0.040120 0.069247 -0.790682 0.125329 0.125008 0.125090
chargesum: -1.00000
title: Mulliken charges with hydrogens summed into heavy atoms:
elementType: C C N Cu C
charge: -0.900891 0.206779 0.040120 0.069247 -0.415255
polarizability: 1.20857794e+02 -2.06918602e+01 9.64019153e+01 -3.53025799e+01 2.79720345e+01 1.29696381e+02
1716.lowfreq: -10.9044 -0.0006 0.0002 0.0007 10.0132 56.1542 63.8235 73.6108 83.7917
frequency: 53.6187 71.0498 79.1487 157.7939 193.5997 293.6318 325.9327 441.4390 534.6955 553.0868 606.6074 615.3140 1004.0463 1158.7954 1174.6113 1414.6661 1444.0467 1446.8205 2167.4111 2978.0314 3046.3677 3048.0681 3177.2543 3270.4194
redmass: 3.9790 2.3190 1.1823 5.1001 4.8210 1.3134 7.9741 3.0740 4.3662 7.5227 1.2425 1.2295 1.5948 1.2381 3.0638 1.3638 1.0606 1.0613 12.1976 1.0334 1.0985 1.0986 1.0526 1.1180
irintensity: 0.0763 0.9480 0.2405 12.5710 7.7574 372.4655 18.3997 1.9268 29.8784 1.3659 111.8374 101.2185 2.2645 8.5575 30.0426 38.2599 0.2683 0.2502 1722.0072 135.7873 79.6292 78.9441 0.3852 2.0752
temp: 298.150 k
press: 1.00000 atm
elementType: 6 1 1 6 7 29 6 1 1 1
symmnumber: 1
zpe: 174992.5 jmol-1
zpe.correction: 0.066651 hartree
zpe.thermalcorrener: 0.074956 hartree
zpe.thermalcorrenthalpy: 0.075900 hartree
zpe.thermalcorrgfe: 0.033762 hartree
zpe.sumelectzpe: -369.461076 hartree
zpe.sumelectthermal: -369.452771 hartree
zpe.sumelectthermalent: -369.451826 hartree
zpe.sumelectthermalfe: -369.493965 hartree
dipole: 6.2601 -0.1492 -6.8567
dipole: 9.2858
quadrupole: -62.8811 -46.3109 -67.7268
quadrupole: 6.9057 20.1752 -10.0273
quadrupole: -3.9082 12.6620 -8.7539 6.9057 20.1752 -10.0273
hfenergy: -369.5277269 hartree
pointgroup: C01 [X(C3H5Cu1N1)]
dipole: -0.1599689 0.1180508 0.2010924 debye
dipolederiv: -1.4260812 0.2078432 0.2831322 0.2007626 -0.4904775 -0.6154161 0.2758134 -0.6189341 -1.2873152 0.2259725 0.1002856 0.1699127 0.1193533 -0.0431892 0.0211543 0.1608226 0.0488936 0.1165498 0.2203337 0.0706485 0.191435 0.0503918 0.0256425 0.0905784 0.1997816 0.0621359 0.053203 1.3553616 -0.8279842 -1.4382264 -0.8179204 0.5452278 0.9787594 -1.4259457 0.9828176 1.7094604 -1.2411723 0.561138 0.9787607 0.5531526 -0.8385048 -0.5878438 0.9683147 -0.5887106 -1.5276263 0.4245507 -0.1052509 -0.1776048 -0.0940284 0.3865394 0.0844376 -0.1652281 0.0832581 0.4876153 -0.3477346 -0.0102223 -0.0161373 -0.0158396 -0.3884053 0.029265 -0.0178194 0.0343593 -0.3483149 -0.3863083 -0.0073336 0.0141544 0.0306113 0.0659469 0.0406855 0.0748943 0.0438866 0.1029641 0.0902068 -0.0598301 0.0299232 -0.0435183 0.0759721 0.0599845 -0.0257722 0.1150354 -0.3657368 0.0848712 0.0707056 -0.0353497 0.0170352 -0.3387519 -0.1016048 -0.044861 -0.1627418 0.0592007 unknown
polarizability: 120.8577943|-20.6918602|96.4019153|-35.3025799|27.9720345|129.6963811 unknown
InChI: InChI=1/C2H2N.CH3.Cu/c1-2-3;;/h1H2;1H3;/rC3H5CuN/c1-3-5-4-2/h1H2,2H3
charge -1 multiplicity 1
10 atoms
C  0.62722787 -1.27390716 -0.84014847
H  0.92121364 -2.31648553 -0.77771271
H  0.9922444 -0.6630032 -1.65922557
C  -0.19309882 -0.7383689 0.09790693
N  -0.91515159 -0.26709977 0.92069239
Cu -1.98299044 0.49595788 2.23269656
C  -3.08143459 1.28499943 3.58869185
H  -4.15736099 1.13206439 3.40174385
H  -2.8724995 0.86669658 4.58744871
H  -2.92690298 2.37407629 3.66624746
