program: Gaussian 16
title: LimoneneNeutral
version: ES64L-G16RevC.01
frameworkgroup: C1[X(C10H16)]
method: RB3LYP
basis: 6-311+G(d,p)
operation: Freq
keyword: #N
keyword: Geom=AllCheck
keyword: Guess=TCheck
keyword: SCRF=Check
keyword: GenChk
keyword: RB3LYP/6-311+G(d,p)
keyword: Freq
converged: YES YES YES YES
title: Mulliken charges:
elementType: C C C C C C C C C C H H H H H H H H H H H H H H H H
charge: -0.429786 -0.546480 0.499712 -0.859109 -0.187430 0.327513 -0.592084 -0.433623 -0.469870 0.434938 0.154343 0.144826 0.137988 0.116053 0.114016 0.120712 0.158291 0.151318 0.110203 0.141376 0.134861 0.147093 0.166152 0.153232 0.153720 0.152034
chargesum: -0.00000
title: Mulliken charges with hydrogens summed into heavy atoms:
elementType: C C C C C C C C C C
charge: -0.110402 -0.240726 0.620424 -0.549500 -0.077228 0.327513 -0.154926 -0.203554 -0.046540 0.434938
chargesum: 0.00000
1716.lowfreq: -1.4279 -0.0013 0.0005 0.0009 5.5932 10.7478 52.5981 72.9946 167.4551
frequency: 52.5529 72.9921 167.4542 175.2597 180.7473 194.5017 254.1234 288.6731 325.8879 340.5256 436.6472 475.1176 495.4896 529.3845 552.1203 643.7090 729.6957 762.3860 799.5360 816.1585 887.0297 919.0437 924.6042 930.6907 969.4992 997.9713 1022.8656 1030.1209 1048.1433 1059.6893 1072.0675 1100.0923 1116.8147 1168.2980 1174.8550 1235.3105 1272.0449 1295.7980 1314.5724 1327.7243 1339.4145 1364.9435 1383.2399 1395.5703 1411.5776 1413.4447 1450.2344 1476.7971 1480.7350 1481.1392 1483.2940 1492.5091 1497.0844 1500.1704 1696.1268 1726.1165 2983.0998 2993.4037 3003.3356 3005.7187 3013.0699 3020.4428 3026.1807 3034.0032 3043.4274 3058.9324 3065.5100 3093.9083 3101.8089 3122.5881 3123.1829 3201.6323
redmass: 2.4678 2.9511 2.8422 1.1306 1.2106 1.7707 2.2090 2.7207 2.4006 2.5276 2.0767 2.4612 2.5911 3.0492 2.7182 3.2873 1.1199 3.2149 1.7529 1.2430 2.4373 1.5305 1.8236 1.5331 1.9538 1.4724 2.0083 1.5793 1.4089 1.8022 1.6687 2.0705 2.6387 1.8847 1.2800 1.3821 1.3289 2.7177 1.2820 1.2901 1.3210 1.3767 1.6289 1.6890 1.2661 1.2778 1.2017 1.0755 1.0627 1.0730 1.0543 1.0613 1.0649 1.0844 4.9707 6.5888 1.0680 1.0701 1.0404 1.0730 1.0793 1.0422 1.0720 1.0925 1.0991 1.1031 1.0989 1.0989 1.0999 1.0632 1.0854 1.1154
irintensity: 0.0757 0.0066 0.3765 0.2845 0.4789 0.1711 1.0761 1.9503 0.5979 0.5437 2.7323 1.9446 1.0478 2.8523 5.7384 0.7134 0.3366 0.7656 3.4253 7.3663 0.1359 33.5287 11.9608 5.7569 2.9496 0.2471 3.1315 2.4808 0.5553 3.1790 3.6023 0.7934 3.2317 6.2556 2.5543 0.6671 1.8841 2.9477 1.9292 0.1371 1.5518 1.9720 0.3008 0.2172 8.7254 6.6818 0.0817 4.8662 5.3885 0.5124 11.8867 10.5786 10.6286 5.4594 29.3627 1.0382 29.8128 14.5268 44.9869 8.3117 42.3371 11.7923 41.9903 48.8910 25.7058 51.0313 11.4324 22.4694 27.9974 22.1296 27.6183 21.3743
temp: 298.150 k
press: 1.00000 atm
elementType: 6 6 6 6 6 6 6 6 6 6 1 1 1 1 1 1 1 1 1 1 1 1 1 1 1 1
symmnumber: 1
zpe: 613940.5 jmol-1
zpe.correction: 0.233838 hartree
zpe.thermalcorrener: 0.244633 hartree
zpe.thermalcorrenthalpy: 0.245577 hartree
zpe.thermalcorrgfe: 0.197790 hartree
zpe.sumelectzpe: -390.549271 hartree
zpe.sumelectthermal: -390.538475 hartree
zpe.sumelectthermalent: -390.537531 hartree
zpe.sumelectthermalfe: -390.585318 hartree
dipole: -0.3668 0.3026 -0.3729
dipole: 0.6043
quadrupole: -64.1988 -64.6093 -64.3773
quadrupole: -0.5691 -1.3726 0.0410
quadrupole: 0.1963 -0.2141 0.0178 -0.5691 -1.3726 0.0410
hfenergy: -390.7831081 hartree
pointgroup: C01 [X(C10H16)]
dipole: -0.1387907 0.1869268 -0.048124 debye
dipolederiv: 0.0001361 -0.0190008 -0.0397316 -0.0002277 0.1657276 -0.0506937 -0.047403 -0.0879238 0.1224896 0.004736 0.0553414 0.0017047 -0.0420164 0.0967581 -0.0480084 -0.0101905 -0.0329427 0.133162 0.0192784 0.0041515 0.0028928 0.0146578 0.0651199 0.0290109 0.0069166 0.0337917 0.077311 -0.0537153 0.0160807 -0.0603321 0.0253002 0.1687626 -0.065449 0.0642932 -0.1092487 0.1141458 0.1114708 -0.0079231 0.0289471 0.0088664 -0.1376575 0.1056539 -0.0024205 0.1358722 -0.1080571 0.3320064 -0.0247488 0.1023065 -0.0009234 0.0778018 -0.2723338 0.0636559 -0.276693 0.0480417 -0.0214627 -0.0213877 -0.0030947 -0.0449142 0.0155472 0.1134536 0.0323937 0.0980581 0.0564522 -0.0967635 0.1206761 -0.089084 0.1089531 -0.2252574 -0.0773767 -0.0859528 -0.07192 -0.2609936 -0.0113278 -0.019403 -0.0382542 0.0058356 0.1295114 -0.0450673 -0.0124337 -0.0510234 0.1126162 0.1855672 -0.0337548 0.0129483 -0.013474 -0.0669123 0.1599029 0.0301287 0.1765428 0.0220213 0.0748661 0.0587511 0.0464246 0.0534243 -0.1162066 0.0152523 0.013868 -0.035278 0.0288035 0.085765 -0.0312818 -0.0548101 0.0000935 0.036248 -0.0246669 -0.0605243 0.0286019 -0.1291461 -0.1721139 -0.0330533 0.0145514 0.0297825 0.0625381 0.0121514 -0.0473418 0.0112298 0.0644671 -0.149273 -0.0001647 -0.0328743 -0.0400231 0.0937513 0.0463907 0.0071233 0.0522317 0.100549 0.0111391 -0.084886 0.0653483 -0.0404716 0.0191633 0.1111108 0.0266559 0.1059867 0.0459995 -0.01312 -0.0267895 0.0291113 -0.0381138 -0.063842 0.0678576 0.0423947 0.0706598 -0.0755901 -0.0252025 0.0645179 0.0210914 0.0699359 -0.1252946 -0.057289 -0.0333615 -0.005288 0.0511748 -0.0657347 0.0033976 0.0926952 -0.0685736 0.0173469 0.0961328 0.0585483 0.0544722 -0.0579184 -0.0680888 -0.048282 -0.1029882 -0.0429305 0.0313123 -0.1233371 -0.0789654 -0.1163242 -0.0225525 -0.0524097 0.0090678 0.0490614 -0.0418851 0.0654141 0.0515351 0.1199632 0.0490153 -0.0978675 0.0005467 -0.0054737 -0.0107167 -0.0789282 -0.0167351 -0.1047381 -0.0958646 -0.0983623 -0.0454733 -0.0443845 0.0405141 0.0029572 0.1157832 -0.1220027 0.0419326 -0.0357407 0.0385798 0.0698078 0.0128103 -0.0386302 0.0142607 -0.0466471 0.0002241 0.0751617 0.075048 0.00819 -0.1455794 -0.0707235 0.1005403 -0.0099198 0.1198841 -0.1217846 -0.0486269 -0.0087989 0.0148603 0.0499522 0.0129108 -0.0217986 0.0295548 -0.0148574 -0.0413403 0.0657403 0.0539263 0.1150068 -0.0619119 -0.0069129 -0.0564604 -0.0720499 -0.0385303 -0.0081936 -0.0736998 -0.0759181 -0.1080952 -0.0919039 unknown
polarizability: 143.9768608|-9.0909346|105.2290369|4.8045447|1.3125525|106.7306015 unknown
InChI: InChI=1/C10H16/c1-8(2)10-6-4-9(3)5-7-10/h4,10H,1,5-7H2,2-3H3
charge 0 multiplicity 1
26 atoms
C  -1.36904265 1.99335389 0.76492806
C  0.14116192 2.23167472 0.64675354
C  0.88489041 0.91006364 0.37296726
C  0.39193406 0.31993471 -0.96600443
C  -1.10927509 0.36944955 -1.10072682
C  2.39676044 1.04242373 0.43357573
C  3.0574862 2.07851778 -0.44398431
C  3.1179332 0.26488828 1.24616467
C  -3.41603183 1.08277594 -0.47945936
C  -1.91818291 1.10117778 -0.32735083
H  2.73613302 3.0900904 -0.17459557
H  2.80356404 1.93817713 -1.49960462
H  4.14408426 2.03543456 -0.350526
H  4.19922774 0.34094452 1.29742913
H  2.64971959 -0.47480718 1.88755847
H  0.59224042 0.20481436 1.16034903
H  0.73554169 -0.71721849 -1.05176002
H  0.85056363 0.85270066 -1.81007628
H  -1.5453127 -0.24714505 -1.88423164
H  -3.90165373 0.78590318 0.45805325
H  -3.73509096 0.38939399 -1.26060936
H  -3.79971691 2.07937957 -0.72824519
H  -1.60547007 1.54772451 1.74208811
H  -1.89942294 2.95365849 0.74808392
H  0.32971617 2.93432715 -0.17288215
H  0.52166547 2.69769965 1.56122512
