program: Gaussian 16
title: LimoneneNeutral
version: ES64L-G16RevC.01
frameworkgroup: C1[X(C10H16)]
method: RB3LYP
basis: 6-311+G(d,p)
operation: Freq
keyword: #N
keyword: Geom=AllCheck
keyword: Guess=TCheck
keyword: SCRF=Check
keyword: GenChk
keyword: RB3LYP/6-311+G(d,p)Freq
converged: YES YES NO NO
title: Mulliken charges:
elementType: C C C C C C C C C C H H H H H H H H H H H H H H H H
charge: -0.593408 -0.544225 0.112142 -0.383020 -0.114534 0.618778 -0.812879 -0.477239 -0.699667 0.642141 0.150219 0.155278 0.139296 0.116561 0.111028 0.125435 0.140199 0.147507 0.109885 0.151802 0.148471 0.139287 0.163958 0.144849 0.146506 0.161631
chargesum: -0.00000
title: Mulliken charges with hydrogens summed into heavy atoms:
elementType: C C C C C C C C C C
charge: -0.284601 -0.236089 0.237576 -0.095314 -0.004648 0.618778 -0.368086 -0.249650 -0.260107 0.642141
1716.lowfreq: -521.8626 -11.2941 -6.5757 -4.6318 -0.0009 0.0004 0.0006 41.9914 55.2263
frequency: -521.8625 41.9710 55.2254 84.0755 125.1329 135.0808 173.0086 194.6912 294.0436 309.6070 341.1278 374.8274 427.2042 450.1090 511.2302 536.3131 537.8798 554.7200 694.1895 707.5264 759.0549 803.5397 827.7659 862.5470 875.7280 907.5346 924.6381 941.5512 976.7768 983.8502 1012.2406 1022.0204 1024.7727 1048.8776 1062.0743 1070.8040 1106.3509 1114.8792 1244.2572 1284.5104 1295.4304 1318.2667 1384.8137 1404.6712 1409.3014 1414.0345 1449.6174 1471.2665 1483.6502 1487.8529 1498.8175 1500.9428 1520.6780 1558.2718 1591.9186 1655.6167 2995.3821 3021.0239 3061.1102 3070.2393 3097.0674 3106.6203 3118.6193 3127.1271 3129.5377 3130.4475 3145.6175 3157.0658 3194.6072 3205.2235 3212.5519 3240.4322
redmass: 8.1394 1.0629 2.9542 2.6850 3.9283 3.1354 1.8163 1.5657 2.4432 2.5123 2.9782 2.7901 2.1866 2.4154 2.1702 2.2602 2.5588 2.1626 1.0843 1.5946 1.6815 2.1555 1.5814 1.3909 1.3707 1.3230 1.2296 1.4027 1.2294 1.3590 1.2184 1.2936 1.3769 1.4489 1.5111 1.2898 1.5921 1.2577 1.9565 1.5010 2.1842 2.1710 1.5657 1.2952 1.3621 1.5016 1.2189 1.3477 1.0500 1.0786 1.1752 1.1151 1.3754 2.0219 2.7919 4.2926 1.0503 1.0384 1.0835 1.0976 1.1015 1.1002 1.0592 1.0575 1.0599 1.0848 1.0868 1.0613 1.1135 1.1135 1.1153 1.1147
irintensity: 2.2968 0.1111 0.3971 0.0862 0.4331 0.5712 1.9077 1.6012 1.4103 1.5516 1.6433 3.7067 0.7398 0.4898 5.0147 5.5821 6.3106 20.0569 6.5746 2.8567 4.5177 1.6307 6.4361 0.3556 38.4457 5.0761 7.8023 2.1967 8.2674 8.6516 1.6463 1.4729 1.6214 14.2204 0.2051 8.0137 1.7821 0.5357 1.9531 1.9278 1.7237 26.8442 0.3709 9.3632 1.1677 7.2375 3.5440 11.9903 9.4606 2.2599 11.0870 10.2545 4.5148 7.9471 3.9141 47.8229 36.5781 20.6684 24.6546 11.9645 12.4329 21.9377 12.0989 16.6147 8.0570 13.4490 7.7651 6.3624 4.7464 11.1257 17.4298 6.0784
temp: 298.150 k
press: 1.00000 atm
elementType: 6 6 6 6 6 6 6 6 6 6 1 1 1 1 1 1 1 1 1 1 1 1 1 1 1 1
symmnumber: 1
zpe: 597292.8 jmol-1
zpe.correction: 0.227497 hartree
zpe.thermalcorrener: 0.239363 hartree
zpe.thermalcorrenthalpy: 0.240307 hartree
zpe.thermalcorrgfe: 0.189654 hartree
zpe.sumelectzpe: -390.462330 hartree
zpe.sumelectthermal: -390.450464 hartree
zpe.sumelectthermalent: -390.449520 hartree
zpe.sumelectthermalfe: -390.500173 hartree
dipole: -0.8384 -0.1553 -0.6315
dipole: 1.0611
quadrupole: -68.4696 -61.2760 -65.3307
quadrupole: 1.2895 3.5824 -1.4020
quadrupole: -3.4441 3.7494 -0.3053 1.2895 3.5824 -1.4020
hfenergy: -390.6898272 hartree
pointgroup: C01 [X(C10H16)]
dipole: -0.3182429 -0.2697892 0.0147493 debye
dipolederiv: 0.0587725 -0.0146019 -0.003404 0.0987855 0.1003002 0.0206836 0.1307687 0.0452807 -0.0198526 0.0242127 0.0891532 0.0394355 -0.0186302 -0.023551 -0.0054945 -0.1369654 -0.0810837 0.0326783 -0.0331769 0.0316828 0.0567809 0.0287254 -0.027137 -0.0638706 -0.1266081 0.0498769 0.0232846 0.0366802 -0.0572441 -0.0402341 0.0995007 -0.0447351 0.0524018 -0.0962363 0.0901891 0.0018728 -0.1363316 0.2261967 -0.0067518 -0.1244047 -0.09484 0.1251555 0.0338048 0.1376784 0.0022443 0.4696204 0.1738201 0.0303181 0.2800192 -0.0222652 -0.0435878 0.427889 -0.093706 0.2028507 0.0234704 -0.015876 0.0665801 -0.0574057 0.1102335 0.0660367 0.0105507 0.0450015 -0.0454218 -0.5649867 0.0433969 0.0145656 -0.1008996 -0.3035514 -0.0559381 -0.1231929 -0.0017232 0.044088 0.2044961 -0.0092661 0.0185995 -0.133297 0.1115773 0.0612744 0.0424174 0.0101153 0.0307777 -0.3814354 -0.005674 -0.1595551 0.3691822 -0.0248051 -0.0769835 -0.2297013 -0.1654048 0.1335498 0.0695662 -0.0329123 0.0188817 -0.029143 -0.1264041 0.043927 0.0405176 -0.0148027 0.0304406 -0.0694099 0.029092 0.0650999 0.0537548 0.023647 -0.0127217 0.0475727 0.0305164 0.0414353 -0.0299996 -0.0309511 -0.1296557 -0.0580674 0.0554532 -0.0627491 -0.0679479 -0.0087399 -0.0466002 0.0193949 -0.0542456 -0.0450389 -0.1004485 0.1262413 -0.0013009 -0.1188846 -0.017283 -0.056573 0.0488393 -0.0459584 0.0010836 -0.0404526 0.1046102 0.050306 0.0584637 0.0678719 -0.1010326 -0.0236886 -0.044001 0.0402494 -0.0249919 0.0570294 0.0410717 0.0012487 0.0276519 -0.0920849 0.0463217 -0.0283692 -0.0162668 -0.0230679 0.044072 -0.0721275 -0.0203125 -0.0080059 -0.0538002 0.0318384 -0.0729154 0.0223668 -0.0705624 -0.0106702 -0.0134299 -0.0199757 -0.0230377 0.0570093 0.0835408 -0.0398868 0.014262 -0.0153177 0.0585782 -0.0681162 0.0456441 -0.1064722 -0.0726654 -0.0066596 0.1022768 -0.0548149 0.0051722 -0.0340436 0.1096727 0.090639 0.0608274 -0.0368128 -0.1408693 -0.0695433 0.0208018 -0.0786521 0.0385659 -0.0043957 -0.0214538 -0.0343402 0.0188974 0.0371344 -0.011029 0.0266368 0.0452537 -0.0532778 -0.1179341 0.0580116 -0.0502733 -0.0195578 0.0359583 -0.0380214 0.0397197 -0.0231384 0.0166965 0.064499 -0.0110705 0.0232552 -0.0657325 0.004536 -0.1186637 -0.0214188 -0.0995812 -0.0389821 -0.0222329 -0.0059681 0.0049216 0.0633258 0.0833133 -0.0019257 0.0094557 0.0208949 -0.0223049 0.0379303 0.0252651 0.0729286 -0.0335123 0.108862 -0.0045334 -0.0076971 -0.0032283 -0.0204371 -0.0520763 -0.034476 -0.0612422 -0.0388086 unknown
polarizability: 187.4639254|9.387774|123.1052304|-5.3442411|2.0802121|111.7548339 unknown
InChI: InChI=1/2C5H8/c2*1-4-5(2)3/h2*4H,1-2H2,3H3
charge 0 multiplicity 1
26 atoms
C  -1.79726829 -0.6860465 -1.03849594
C  0.15413184 -1.37698437 -0.95004142
C  1.12539559 -0.36562939 -0.91661158
C  -0.25829844 1.68739396 -0.84039059
C  -1.17324764 1.33554885 0.12287979
C  1.9758354 -0.06604975 0.24053921
C  1.53458252 -0.54261487 1.60336868
C  3.14599247 0.58060668 0.08583355
C  -2.7177358 -0.29560712 1.27544612
C  -1.96427212 0.17033049 0.05154564
H  1.48843416 -1.63591676 1.64722691
H  0.53661566 -0.1673883 1.84878848
H  2.22747743 -0.20556428 2.37589809
H  3.79791792 0.78274199 0.92754431
H  3.48211184 0.91972242 -0.88846924
H  1.51802513 -0.02356283 -1.86918197
H  -0.36780713 1.3795039 -1.87001805
H  0.43457785 2.50187753 -0.66693307
H  -1.15833785 1.87657363 1.06633209
H  -2.15087483 -1.0560606 1.82928017
H  -3.68142592 -0.73992753 1.01347959
H  -2.90439969 0.53320994 1.96219581
H  -1.624005 -0.26088647 -2.01916792
H  -2.3626371 -1.61352828 -1.06199901
H  0.0272346 -2.00378068 -0.07515835
H  0.0271954 -1.90676566 -1.88745031
