program: Gaussian 16
title: Title
version: ES64L-G16RevC.02
frameworkgroup: C1[X(C4H5B11I11)]
method: RB3LYP
basis: def2TZVPP
operation: Freq
keyword: #N
keyword: Geom=AllCheck
keyword: Guess=TCheck
keyword: SCRF=Check
keyword: GenChk
keyword: RB3LYP/def2TZVPP
keyword: Freq
converged: YES YES YES YES
title: Mulliken charges:
elementType: B B B B B B B B B B B I I I I I I I I I I C I C H H C H C H H
charge: -0.112755 -0.064790 -0.106705 -0.035890 -0.076072 -0.089552 -0.111030 -0.077266 -0.042058 -0.120806 -0.108859 -0.072743 -0.072679 -0.040907 -0.039929 -0.073356 -0.072836 -0.040673 -0.027413 -0.035954 -0.073782 0.637460 -0.075321 -0.185376 0.090736 0.129624 -0.206160 0.127950 -0.195111 0.082954 0.089295
chargesum: -1.00000
title: Mulliken charges with hydrogens summed into heavy atoms:
elementType: B B B B B B B B B B B I I I I I I I I I I C I C C C
charge: -0.112755 -0.064790 -0.106705 -0.035890 -0.076072 -0.089552 -0.111030 -0.077266 -0.042058 -0.120806 -0.108859 -0.072743 -0.072679 -0.040907 -0.039929 -0.073356 -0.072836 -0.040673 -0.027413 -0.035954 -0.073782 0.637460 -0.075321 0.034985 -0.078210 -0.022862
1716.lowfreq: -1.5700 -0.0002 0.0003 0.0004 1.0556 1.3277 49.3015 54.1803 55.7961
frequency: 49.3010 54.1803 55.7960 56.2572 56.7548 60.3851 63.7098 66.0904 67.3153 69.8483 70.9291 71.5789 72.2523 73.1426 75.5672 77.4841 79.1652 84.0083 85.9307 90.4099 99.7182 142.0592 142.4068 145.0488 145.3324 146.4425 150.3878 152.2104 152.3743 173.8548 193.5256 248.5817 304.1245 362.5706 377.8895 378.3854 396.8645 401.8228 420.4074 496.6770 498.9467 524.3143 555.0185 565.4632 569.8355 628.5885 633.7595 637.4273 642.2028 667.2168 693.9339 695.3443 701.4733 709.1843 736.7169 740.7355 773.1797 773.7454 778.7452 834.5961 835.6697 864.6437 881.8315 887.7985 896.8180 900.8902 918.9606 926.0840 934.2745 939.8807 944.8801 957.9369 983.2051 1043.1754 1118.5623 1167.1697 1313.6375 1335.0603 1375.3282 1460.9595 1472.0644 1709.0825 3045.5698 3107.6470 3136.2286 3191.6323 3221.6199
redmass: 7.7753 113.2370 96.7516 58.4262 70.1963 31.8648 94.1650 35.9526 48.7053 33.6259 46.3557 122.6032 100.9737 50.3656 48.2896 107.0205 17.5551 37.2771 33.7766 19.4002 4.4428 92.1252 103.4715 100.9473 95.6033 110.5681 110.0556 99.4869 113.0388 2.6467 4.4066 3.4281 3.8609 11.1715 11.8440 11.5257 7.5799 3.5627 5.3743 10.9589 10.7190 2.6415 7.7157 10.9352 3.8586 4.8189 10.3651 11.1215 9.7324 4.9801 10.7846 10.7254 10.0572 8.8189 10.9792 10.9865 6.7244 7.1805 8.3182 11.0300 11.0856 10.5021 5.5964 10.1502 10.9809 10.7958 2.7356 10.5797 6.8209 4.9486 1.6467 2.8922 2.9068 1.1622 5.5778 2.1445 1.1535 1.2404 1.2405 1.1547 1.1085 4.5036 1.0652 1.0944 1.0588 1.0927 1.1135
irintensity: 0.0381 0.0002 0.0003 0.0015 0.0018 0.0088 0.0003 0.0010 0.0051 0.0051 0.0237 0.0013 0.0018 0.0235 0.0072 0.0020 0.0571 0.2130 0.1819 0.0767 0.2296 0.0004 0.0005 0.0006 0.0003 0.0013 0.0081 0.0008 0.0007 0.4143 0.0966 1.6413 1.8112 0.0034 6.2405 5.6941 8.2655 7.4488 7.9911 0.1346 0.3027 8.3288 0.4181 0.0187 2.9848 4.6825 1.8876 0.0222 2.4870 1.2350 0.8672 1.2584 3.3125 3.1381 0.0596 0.1156 0.2118 0.8640 0.2529 0.0656 0.0695 2.9635 7.4363 0.2824 1.3598 1.4988 67.1009 148.8367 19.4405 129.1398 112.0113 100.5403 37.0499 16.9589 17.4051 1.6041 1.2967 0.3055 5.7460 4.3978 10.5276 11.5690 4.3969 0.1623 10.4682 0.2225 14.1271
temp: 298.150 k
press: 1.00000 atm
elementType: 5 5 5 5 5 5 5 5 5 5 5 53 53 53 53 53 53 53 53 53 53 6 53 6 1 1 6 1 6 1 1
symmnumber: 1
zpe: 354943.0 jmol-1
zpe.correction: 0.135191 hartree
zpe.thermalcorrener: 0.167520 hartree
zpe.thermalcorrenthalpy: 0.168464 hartree
zpe.thermalcorrgfe: 0.063373 hartree
zpe.sumelectzpe: -3705.447749 hartree
zpe.sumelectthermal: -3705.415420 hartree
zpe.sumelectthermalent: -3705.414476 hartree
zpe.sumelectthermalfe: -3705.519567 hartree
dipole: -0.5828 -0.0709 -3.0253
dipole: 3.0818
quadrupole: -417.9033 -417.9973 -410.9457
quadrupole: -0.1537 2.0783 0.6283
quadrupole: -2.2879 -2.3819 4.6698 -0.1537 2.0783 0.6283
hfenergy: -3705.5829398 hartree
pointgroup: C01 [X(C4H5B11I11)]
dipole: -0.013493 -0.1478112 -1.20334 debye
polarizability: 522.409101|-1.198074|517.8715974|-12.1703702|-3.5808997|520.8568701 unknown
InChI: InChI=1/C4H5B11I11/c1-2-3-4-5(16)6(4,17)8(4,19)9(4,20)7(4,5,18)11(5,22)10(5,6,21)12(6,8,23)14(8,9,25)13(7,9,11,24)15(10,11,12,14)26/h2H,1,3H2
charge -1 multiplicity 1
31 atoms
B  -0.93912018 -1.16550319 0.99964965
B  0.03332009 0.11321307 1.77786151
B  1.47656926 0.3986232 0.77006736
B  -1.48256322 -0.54958649 -0.56692016
B  -0.84716952 1.09657588 -0.7714748
B  0.09177143 1.51336972 0.67097447
B  0.83863185 -1.25953343 0.97071036
B  -0.0936492 -1.65956608 -0.49351366
B  1.40677848 -0.70750114 -0.62102493
B  0.93158899 0.99590091 -0.81456401
B  -1.40368978 0.54917643 0.82070122
I  -2.14235972 -2.57012178 2.11860152
I  3.36936612 1.01904938 1.61066319
I  -3.33889696 -1.15119161 -1.4951798
I  -1.91095896 2.55802345 -1.95610978
I  0.21322304 3.55648093 1.36495396
I  1.90608269 -2.78349416 2.07158687
I  -0.2265851 -3.64894491 -1.32620956
I  3.22308199 -1.50439994 -1.47940763
I  2.08263537 2.32002602 -2.07026774
I  -3.20377651 1.3512487 1.7097961
C  -0.03011457 -0.26329644 -1.49891722
I  0.07901357 0.35775309 3.92454611
C  -0.18208777 -0.35687922 -3.02336446
H  -0.29813709 0.65891283 -3.39263566
H  -1.1356811 -0.85773037 -3.19716692
C  0.86115775 -1.05068084 -3.8385287
H  1.06171385 -2.08525646 -3.60160837
C  1.45844691 -0.47836944 -4.87399115
H  1.28485519 0.56025671 -5.12520065
H  2.16397011 -1.02370833 -5.48628042
