program: Gaussian 16
title: Title
version: ES64L-G16RevC.02
frameworkgroup: C1[X(C5H6B11I11O2)]
method: UB3LYP
basis: def2TZVPP
operation: Freq
keyword: #N
keyword: Geom=AllCheck
keyword: Guess=TCheck
keyword: SCRF=Check
keyword: GenChk
keyword: UB3LYP/def2TZVPP
keyword: Freq
converged: YES YES YES YES
elementType: B
elementType: I
elementType: C
elementType: H
elementType: O
1716.lowfreq: -1.3694 -0.0006 -0.0003 0.0003 2.1965 2.5317 24.5632 28.2167 51.2692
frequency: 24.5597 28.2118 51.2689 54.3798 55.3628 57.7457 58.0830 60.3933 64.5191 66.6915 68.5026 70.1094 71.4986 71.9925 72.2485 72.9000 74.3945 77.6024 78.1183 83.7966 85.0946 91.4445 110.5940 128.7693 142.5789 142.7840 145.3448 145.4767 146.6635 148.6465 150.8398 152.5238 152.6893 172.8855 231.7686 250.9720 320.9742 349.6279 362.4129 378.1745 379.3457 395.8110 401.1473 491.0639 498.1506 500.2349 547.1622 565.9553 577.1988 588.2357 631.5097 636.0141 639.0708 639.7793 649.9573 675.2564 695.2810 697.0321 705.3595 712.6628 734.0111 737.6493 740.9743 774.4971 776.5799 783.8456 836.0162 837.0815 853.7310 865.1500 884.3014 890.2571 898.3617 901.9766 916.6355 925.5236 937.5919 947.1691 958.6319 1091.1029 1097.7084 1145.7388 1176.8173 1211.5293 1276.0015 1284.4125 1339.5410 1430.8265 1463.9350 1472.9938 1483.2791 1499.3817 1691.2877 2997.1183 3041.7823 3105.3882 3136.6152 3143.7942 3246.1497
redmass: 5.8122 5.7513 17.0840 90.1110 101.2244 77.8195 70.1222 30.4564 90.2088 32.7669 82.7017 37.1256 123.7735 111.4483 78.9074 72.1329 19.9045 50.8240 120.4003 61.7904 66.4716 49.8799 3.0069 2.3541 100.1660 99.1641 95.0220 69.8826 74.0385 2.3253 16.4087 94.8078 101.6492 5.6851 2.8839 4.2630 4.0847 6.7706 11.1735 11.8820 11.2354 6.2389 11.7741 5.9901 10.8133 10.3181 6.2136 10.9940 6.0748 6.1999 8.8028 10.5937 9.3595 2.3219 3.4301 6.8639 10.8807 10.9189 8.9382 9.1176 5.9594 10.5823 10.9863 10.8318 10.5009 4.2060 11.0516 11.0264 4.7383 10.8006 6.6247 10.4006 10.6740 10.9950 3.0480 10.9689 10.9426 9.5384 5.7050 6.9523 7.4632 3.0096 1.2829 1.4845 1.4827 1.9092 1.4397 1.6203 1.0833 1.2180 1.0480 1.0534 9.9643 1.0706 1.0301 1.1056 1.0870 1.1047 1.0878
irintensity: 0.5380 0.0611 0.4990 0.0189 0.0028 0.0312 0.0172 0.2250 0.0057 0.1115 0.0171 0.1745 0.0007 0.0049 0.0642 0.0085 0.2093 0.1043 0.0020 0.1975 0.2441 0.0218 0.5638 0.3904 0.0228 0.0127 0.0007 0.0518 0.0317 0.0555 0.0266 0.0091 0.0103 3.6637 3.7086 10.1598 7.3643 1.3035 0.0007 5.4748 5.4394 6.2394 13.6369 12.1339 0.2939 0.7365 2.5808 0.0141 3.3003 3.5259 5.5805 0.7208 0.6385 4.9470 1.0098 6.0771 0.7006 0.1920 4.7490 5.9369 4.5639 0.1738 0.1047 0.0362 0.2394 2.6589 0.0883 0.6688 15.0174 3.1845 9.0774 2.1582 1.8883 0.1360 81.3905 144.6708 25.7227 177.8443 132.1691 92.8938 55.6850 13.7191 0.9167 32.6577 77.6308 178.7538 49.3025 14.7075 6.6148 22.0117 6.0932 4.6345 267.6770 13.0000 55.0813 22.8226 2.0018 13.1433 5.4815
temp: 298.150 k
press: 1.00000 atm
elementType: 5 5 5 5 5 5 5 5 5 5 5 53 53 53 53 53 53 53 53 53 53 6 53 6 1 6 1 6 8 6 1 1 1 8 1
symmnumber: 1
zpe: 420094.2 jmol-1
zpe.correction: 0.160005 hartree
zpe.thermalcorrener: 0.195826 hartree
zpe.thermalcorrenthalpy: 0.196770 hartree
zpe.thermalcorrgfe: 0.082105 hartree
zpe.sumelectzpe: -3894.653933 hartree
zpe.sumelectthermal: -3894.618113 hartree
zpe.sumelectthermalent: -3894.617168 hartree
zpe.sumelectthermalfe: -3894.731834 hartree
dipole: 1.5404 1.3811 1.4988
dipole: 2.5547
quadrupole: -442.7059 -435.0385 -430.0238
quadrupole: 13.3399 -1.5361 2.7131
quadrupole: -6.7832 0.8843 5.8989 13.3399 -1.5361 2.7131
hfenergy: -3894.8139387 hartree
pointgroup: C01 [X(C5H6B11I11O2)]
dipole: 0.5174955 0.2405153 -0.8274094 debye
polarizability: 532.4925793|2.6725889|530.589522|10.8415005|-7.9813385|566.8488357 unknown
InChI: InChI=1/C5H6B11I11O2/c1-29-4(28)2-3-5-6(17)7(5,18)9(5,20)10(5,21)8(5,6,19)12(6,23)11(6,7,22)13(7,9,24)15(9,10,26)14(8,10,12,25)16(11,12,13,15)27/h2H,3H2,1H3
charge -1 multiplicity 2
35 atoms
B  -1.32780651 0.83099575 0.07071439
B  -0.191883 0.29888631 1.33831543
B  0.50761295 -1.26283922 0.83445025
B  -0.39941909 1.0996047 -1.4183081
B  1.30955947 0.73503242 -1.0734358
B  1.44336635 0.24371417 0.62648244
B  -1.20411081 -0.90150445 0.48793118
B  -1.33064424 -0.40033838 -1.21077356
B  -0.19479661 -1.69183893 -0.74633903
B  1.43460268 -0.98707236 -0.64918285
B  0.30794271 1.53680447 0.15293571
I  -3.09921077 1.99123474 0.50303597
I  1.09465924 -2.79055689 2.24595898
I  -0.94694012 2.53621468 -2.92935971
I  2.89161886 1.72284111 -2.16140748
I  3.23411401 0.64944577 1.76616046
I  -2.81727978 -1.96553633 1.45520136
I  -3.06864237 -0.79816495 -2.42594448
I  -0.4789823 -3.74158937 -1.36963853
I  3.17075443 -2.14430024 -1.20640899
I  0.64070227 3.6046336 0.68278506
C  0.27927127 -0.4408913 -1.83558629
I  -0.50741863 0.78186243 3.42020819
C  0.59344966 -0.72004753 -3.31359646
H  0.89040613 0.22149901 -3.76310115
C  -0.44033987 -1.36619089 -4.15626875
H  -0.81426621 -2.3432745 -3.90502794
C  -0.87113153 -0.85386481 -5.43396854
O  -0.26765698 0.31610087 -5.77156925
C  -0.73390188 0.92948468 -6.97000546
H  -1.79968229 1.14474857 -6.89886158
H  -0.16790537 1.85146947 -7.06768225
H  -0.56360406 0.28194731 -7.82984133
O  -1.69022428 -1.39777129 -6.15268919
H  1.481726 -1.36062433 -3.3120183
