program: Gaussian 09
title: 000075729
version: EM64L-G09RevD.01
frameworkgroup: C1[X(C15H18O6)]
method: RPBEPBE
basis: SDD
operation: Freq
keyword: #pfreq=noraman
keyword: PBEPBE/SDD
title: #p freq=noraman PBEPBE/SDD
converged: NO YES NO NO
title: Mulliken charges:
elementType: O O O O O O C C C C C C C C C C C C C C C H H H H H H H H H H H H H H H H H H
charge: -0.277490 -0.305572 -0.425305 -0.198065 -0.451943 -0.188606 -0.034361 0.382850 0.275719 -0.241192 -0.189537 -0.450367 -0.094754 -0.464850 -0.155327 -0.237643 -0.721625 0.155944 0.403440 -0.817840 -0.715386 0.256804 0.266662 0.302845 0.206803 0.293672 0.231298 0.286781 0.278068 0.204149 0.221538 0.295732 0.349199 0.369995 0.259249 0.231736 0.234433 0.231886 0.231061
chargesum: 0.00000
title: Mulliken charges with hydrogens summed into heavy atoms:
elementType: O O O O O O C C C C C C C C C C C C C C C
charge: -0.277490 -0.305572 -0.076106 -0.198065 -0.081948 -0.188606 -0.034361 0.382850 0.275719 0.015612 0.077125 -0.147522 0.112050 0.060119 0.131455 0.040425 -0.000205 0.155944 0.403440 -0.092422 -0.252440
polarizability: 1.77288896e+02 3.29702406e+00 1.52838654e+02 -1.35131188e+01 8.87614733e+00 1.57158976e+02
1716.lowfreq: -13.2190 -0.0004 0.0004 0.0004 3.2113 10.7062 73.3562 92.0312 105.1671
frequency: 73.2532 92.0125 105.1595 116.0945 123.3848 149.7772 165.3827 189.0216 194.6978 209.6269 225.2329 233.8579 255.3972 265.3945 284.8802 303.2927 310.6349 332.3529 348.8168 360.9562 370.3243 403.7573 418.9131 426.7834 433.8880 475.7714 499.8739 512.2457 529.9842 542.4105 561.8753 590.4677 607.7421 630.1908 666.9793 705.2647 739.9325 763.7461 778.3752 803.7106 812.9168 825.9890 837.4053 853.6240 864.8572 875.7484 914.2072 918.2652 938.0674 946.8647 953.1088 984.3977 1003.2492 1005.9289 1013.1522 1023.9148 1032.6999 1048.2005 1058.2457 1063.6625 1069.3950 1096.6069 1105.8708 1120.8975 1125.1251 1149.3807 1151.9094 1184.9783 1198.6059 1224.1141 1233.9122 1245.3871 1251.9771 1265.3527 1282.6736 1300.6351 1307.2692 1318.1290 1325.9783 1348.5748 1360.5943 1378.4312 1392.2645 1399.7296 1405.1378 1436.7692 1461.8506 1463.9394 1475.6356 1485.4113 1492.0509 1656.2412 1700.7239 2952.0225 2971.8644 2974.0604 2994.2094 3053.9857 3078.9828 3082.5799 3086.3705 3092.9634 3101.2208 3102.5406 3133.2602 3144.6094 3165.0901 3200.1575 3212.4356 3468.3314 3485.9581
redmass: 4.0575 5.2826 4.3733 4.5537 5.7799 4.7868 2.2498 1.4475 1.0915 6.3299 4.6473 5.7319 5.1864 4.8800 3.6561 4.0540 4.8607 4.2417 4.4311 3.6639 4.1080 2.1479 2.8393 2.6321 2.9107 1.4016 3.7238 3.5118 4.3369 4.5835 3.8843 3.9340 5.0050 5.7765 1.9301 2.9230 3.8225 5.6010 5.3866 3.4988 3.1933 3.1431 3.8811 4.3122 5.3790 4.1225 2.0987 2.3635 2.4450 1.4006 1.6817 2.4312 2.3460 1.6847 1.8949 2.5441 1.9148 2.1832 1.4177 1.7377 1.8604 3.8898 2.4974 4.2353 2.0559 1.6018 1.6816 1.6108 1.4658 1.5406 1.5457 1.7220 1.4825 1.5758 1.5813 1.6398 1.3122 1.5701 1.8442 2.2923 1.6654 2.4900 1.4549 1.2123 1.4200 1.2048 1.0551 1.0518 1.1532 1.0586 1.0526 4.5970 12.4622 1.0816 1.0790 1.0408 1.0381 1.0959 1.0990 1.0870 1.0565 1.0993 1.0640 1.0891 1.0982 1.0899 1.0975 1.1136 1.1168 1.0668 1.0661
irintensity: 1.1867 3.9366 0.6092 12.6351 11.6042 1.2946 1.2822 1.7372 2.2052 8.6987 14.1877 13.8978 2.5373 4.7149 7.9432 12.5824 2.0300 5.3096 7.2481 2.1246 1.4806 40.6404 56.5833 86.4735 18.7137 94.6794 19.5292 15.2758 8.7863 9.7002 13.5225 8.7068 2.9893 1.6503 5.8336 3.6147 6.4885 14.2654 1.4077 8.8406 9.2150 22.5551 31.4455 12.4726 24.7956 38.9870 21.4431 15.7545 16.5637 68.8391 24.2260 34.2293 15.3090 3.0706 19.5251 34.2735 15.9482 32.9990 5.9943 35.9302 29.5359 40.8368 5.5893 6.7628 30.0500 2.8529 11.7554 16.0095 8.5210 14.5385 16.4422 11.6838 11.6208 7.8706 12.9312 1.4354 7.3832 23.0576 7.3739 2.0020 7.2493 18.1558 15.0350 33.1778 10.4845 0.8493 7.6542 21.4357 5.8805 19.6751 18.5438 20.6120 286.0671 11.4083 31.5929 16.7790 27.2986 9.7828 21.2138 7.0897 15.0000 18.4086 2.6943 10.1978 1.3205 5.5381 8.5343 18.6640 1.2665 38.4491 38.2145
temp: 298.150 k
press: 1.00000 atm
elementType: 8 8 8 8 8 8 6 6 6 6 6 6 6 6 6 6 6 6 6 6 6 1 1 1 1 1 1 1 1 1 1 1 1 1 1 1 1 1 1
symmnumber: 1
zpe: 804441.8 jmol-1
zpe.correction: 0.306396 hartree
zpe.thermalcorrener: 0.325331 hartree
zpe.thermalcorrenthalpy: 0.326275 hartree
zpe.thermalcorrgfe: 0.262365 hartree
zpe.sumelectzpe: -1032.023001 hartree
zpe.sumelectthermal: -1032.004066 hartree
zpe.sumelectthermalent: -1032.003122 hartree
zpe.sumelectthermalfe: -1032.067033 hartree
dipole: 4.9889 -0.2143 -0.4144
dipole: 5.0106
quadrupole: -115.1468 -136.0896 -131.0365
quadrupole: 1.5855 -4.0228 6.7047
quadrupole: 12.2775 -8.6653 -3.6122 1.5855 -4.0228 6.7047
hfenergy: -1032.3293971 hartree
pointgroup: C01 [X(C15H18O6)]
dipole: 1.9571165 0.0429834 -0.2323885 debye
polarizability: 175.6983009|1.9935506|157.352657|-15.7020585|7.584595|154.2355674 unknown
InChI: InChI=1S/C15H18O6/c1-5(2)6-7-12(17)20-8(6)9(16)13(3)14(4-19-14)10-11(21-10)15(7,13)18/h6-11,16,18H,1,4H2,2-3H3
charge 0 multiplicity 1
39 atoms
O  -2.183681 2.007687 -1.128572
O  -3.022916 -1.335025 -0.5440
O  0.846096 1.683055 -1.445643
O  0.321941 -1.236329 1.89986
O  -0.46185 -2.857413 -0.501621
O  -0.560102 0.677848 2.891447
C  -0.619533 -0.35652 -0.868528
C  -1.983756 -0.32522 -0.107387
C  0.05746 1.02093 -0.4106
C  -2.364386 1.119949 0.087483
C  -1.120838 1.940926 -0.069543
C  0.946429 0.838014 0.878876
C  0.288287 -1.599205 -0.580026
C  -2.510011 -1.316087 0.888885
C  1.172359 -1.493515 0.676152
C  2.072527 -0.227447 0.67262
C  -0.921136 -0.35609 -2.3968
C  0.143485 0.166943 2.006925
C  3.121897 0.016281 -0.408558
C  3.864218 1.339336 -0.271086
C  3.495284 -0.908843 -1.336029
H  -3.193241 1.396111 0.744233
H  -0.936683 2.872674 0.473484
H  1.306677 1.826937 1.202003
H  0.983522 -1.675642 -1.440729
H  -1.898278 -2.172954 1.177701
H  -3.24717 -0.963382 1.620258
H  1.690542 -2.445258 0.86469
H  2.64145 -0.253142 1.627868
H  0.017039 -0.31446 -2.978315
H  -1.455943 -1.283433 -2.671968
H  -1.543012 0.504822 -2.678145
H  1.54889 1.059461 -1.771415
H  -1.340832 -2.747724 -0.957413
H  3.186079 2.203395 -0.39551
H  4.31867 1.424823 0.735491
H  4.672764 1.424617 -1.016084
H  4.321024 -0.705229 -2.027377
H  3.031327 -1.896892 -1.419931
