program: Gaussian 16
title: Title
version: AS64L-G16RevC.02
frameworkgroup: C1[X(C12H12N)]
method: RB3LYP
basis: def2TZVPP
operation: Freq
keyword: #N
keyword: Geom=AllCheck
keyword: Guess=TCheck
keyword: SCRF=Check
keyword: GenChk
keyword: RB3LYP/def2TZVPPFreq
converged: YES YES YES YES
title: Mulliken charges:
elementType: C C C C C C H H H C H C C H H H N C H C H C H H H
charge: -0.084880 -0.110129 0.081414 0.021972 -0.073012 -0.026233 0.200669 0.163975 0.150217 -0.030649 0.154763 -0.127059 0.066635 0.168716 0.179174 0.189555 -0.064550 -0.051326 0.100701 -0.184245 0.136420 -0.205329 0.128915 0.106530 0.107757
chargesum: 1.00000
title: Mulliken charges with hydrogens summed into heavy atoms:
elementType: C C C C C C C C C N C C C
charge: 0.079096 0.040088 0.081414 0.021972 0.081751 -0.026233 0.138066 0.052115 0.256190 0.136118 0.157132 -0.047826 0.030116
1716.lowfreq: -7.7503 -3.6180 -2.9767 -0.0006 0.0002 0.0004 36.1930 71.9234 108.2204
frequency: 36.1879 71.9231 108.2200 172.9732 177.9090 271.0795 317.1882 382.3205 391.0674 445.0917 471.4738 474.7565 526.7221 539.7939 626.3532 632.6320 651.2544 747.4121 767.7030 787.5246 789.5944 838.2766 850.3247 899.5864 938.1135 952.0469 962.4857 984.3244 989.3515 990.6467 1012.7355 1034.9588 1036.8085 1081.4333 1134.1028 1151.4476 1185.8017 1192.0633 1239.5177 1253.0108 1258.3150 1302.0140 1324.9716 1333.9524 1339.0409 1397.7845 1417.3596 1435.0383 1455.4329 1472.3632 1494.6734 1526.2975 1595.5809 1622.4555 1649.2299 1669.2790 1713.6333 3019.8084 3050.2376 3136.5213 3141.9965 3181.7213 3193.5201 3194.9233 3196.3293 3224.9349 3228.6852 3235.5548 3563.6660
redmass: 3.0752 3.0855 3.1834 2.9077 3.6307 3.6761 3.5385 2.5449 3.1259 3.0616 2.6635 2.5474 3.2236 6.5015 2.5444 4.1775 3.0266 1.5232 2.4564 2.8350 3.6156 1.3525 1.5038 1.6050 3.3057 1.5865 2.2213 3.2740 1.3706 1.3822 1.3611 1.3284 1.1923 2.2718 1.8433 1.8525 1.6194 1.1937 1.5546 1.4777 1.5628 1.5546 1.7070 1.5356 1.6514 5.2811 2.0476 3.0539 1.1450 1.1774 2.2505 2.2097 3.0320 4.0389 4.6236 5.0383 4.5530 1.0592 1.1009 1.0725 1.0782 1.0887 1.0913 1.0958 1.0918 1.0924 1.1157 1.0982 1.0789
irintensity: 0.3651 0.3656 2.6149 0.1778 0.4821 0.2045 0.3038 0.8663 1.9443 1.3489 4.1282 23.8085 2.3913 2.4077 3.2357 6.8231 1.0180 38.1398 19.4057 4.4434 0.6671 51.1966 11.7470 6.4795 3.8850 3.6700 6.2811 2.2219 39.2732 7.9461 0.4657 4.2123 11.4251 1.4110 1.5717 3.5313 6.3899 1.9980 13.8769 4.9520 26.1109 1.7719 6.0855 12.3218 2.0547 63.2886 15.2169 39.1567 5.4439 11.2020 1.7461 16.4940 29.2868 53.5266 44.3870 22.8954 5.3147 6.2095 3.7189 7.9708 0.4853 0.2419 0.5294 0.6759 0.5737 3.1308 4.4176 11.1685 116.9641
temp: 298.150 k
press: 1.00000 atm
elementType: 6 6 6 6 6 6 1 1 1 6 1 6 6 1 1 1 7 6 1 6 1 6 1 1 1
symmnumber: 1
zpe: 553222.2 jmol-1
zpe.correction: 0.210711 hartree
zpe.thermalcorrener: 0.221324 hartree
zpe.thermalcorrenthalpy: 0.222268 hartree
zpe.thermalcorrgfe: 0.173542 hartree
zpe.sumelectzpe: -519.056631 hartree
zpe.sumelectthermal: -519.046018 hartree
zpe.sumelectthermalent: -519.045074 hartree
zpe.sumelectthermalfe: -519.093800 hartree
dipole: -6.8178 0.8210 -0.1182
dipole: 6.8680
quadrupole: -27.5309 -54.1286 -76.2166
quadrupole: -0.8998 -0.7464 -0.3282
quadrupole: 25.0945 -1.5033 -23.5912 -0.8998 -0.7464 -0.3282
hfenergy: -519.2673422 hartree
pointgroup: C01 [X(C12H12N1)]
dipole: -2.6822275 0.3237525 -0.0463275 debye
dipolederiv: -0.1148911 -0.0091309 0.0081876 0.118204 0.2579206 -0.0013633 -0.0043766 -0.0057344 -0.0491275 -0.2335562 -0.0629852 -0.0008834 -0.1565635 0.0507589 0.0010225 0.005268 0.001351 -0.1164608 -0.0014367 -0.062899 0.0029763 0.6182484 0.2648637 -0.0017794 0.0050435 0.0013334 0.114881 0.2890892 0.099191 -0.0061113 -0.5190014 -0.4497185 -0.0002943 0.0028729 0.0009069 0.0464425 -0.2849678 -0.0112433 0.0097307 -0.205723 0.0456305 0.0072704 0.0100712 0.0090871 -0.0792153 0.6863955 0.0519686 -0.0366836 -0.0017251 -0.2674607 -0.0075914 -0.1323674 0.0079246 0.0038621 0.2620812 -0.0899791 -0.000821 -0.0973945 0.2416925 0.0004074 -0.0005827 -0.0004178 0.2657929 0.071513 -0.0537807 -0.0023851 -0.0304476 0.0411561 0.0002798 -0.0027842 -0.0045221 0.1185641 0.0032823 0.0639134 0.0004207 0.0286626 0.0399715 -0.0003454 -0.0016145 -0.0016283 0.1449037 0.5224173 0.0193822 0.0015684 0.1764903 0.3108039 -0.0009231 -0.0026071 0.0011149 0.0092733 0.1431321 -0.0122262 0.0001064 0.035708 0.0181919 -0.0037032 0.0137764 -0.0061437 0.1106749 -0.5609747 0.1210009 -0.0003765 0.3840206 0.0042392 0.0007609 -0.0017258 0.000691 -0.1074733 0.067052 -0.0311183 0.0019256 -0.5576957 0.3641037 0.0002628 -0.0007865 0.0005153 0.0687192 0.0718987 0.0446354 -0.000036 0.0229006 0.0704575 -0.0004175 0.0007549 -0.0002088 0.1186098 0.0776013 -0.0138577 -0.0000655 -0.0031876 0.0883401 -0.0003955 0.0004898 -0.0004969 0.1506066 0.1238022 0.0172145 -0.0003763 0.0196344 0.0861935 -0.0001376 -0.0004509 -0.0002631 0.147211 -0.0220244 0.0227933 -0.000755 0.2395389 -0.3524212 -0.0000751 0.0032212 -0.0011528 -0.1094304 0.007416 -0.0195168 0.0417994 -0.0564106 0.0774861 0.0328288 0.2281375 0.0387025 0.0824043 -0.0550293 -0.0083833 0.0223183 0.0720005 0.0719325 0.0029584 -0.0341351 0.0426495 -0.0391611 -0.1688712 -0.1375149 -0.0484773 -0.3174274 0.0511484 -0.0306213 -0.0003644 -0.0466406 0.076473 0.1018 0.0329423 0.0446986 0.083618 0.0341702 0.0352604 0.0444677 0.0229208 -0.0606146 -0.1881968 -0.0880986 -0.0481686 -0.0403969 -0.0754786 -0.0849017 -0.084608 -0.0961138 0.0522122 0.0890044 0.0660018 0.0083869 0.0941589 0.0237762 0.0328582 -0.005566 0.0625503 0.0480918 0.1249263 0.0322391 0.0051167 0.0146978 0.0605264 0.0785789 0.0324371 0.0304942 -0.0451102 -0.0114633 0.0294514 -0.0020961 0.0780901 -0.0582846 -0.0599397 -0.074571 -0.0569192 0.0478708 unknown
polarizability: 209.0208367|9.3283858|149.2504313|-4.8153792|2.4543952|80.6649882 unknown
InChI: InChI=1/C12H12N/c1-2-4-10-6-7-12-11(9-10)5-3-8-13-12/h2-3,5-9,13H,1,4H2
charge 1 multiplicity 1
25 atoms
C  0.60429105 1.90434872 0.00019333
C  -0.76609674 1.94427197 -0.00406614
C  -1.47401831 0.73580528 -0.00788988
C  -0.7858646 -0.50785956 -0.00866129
C  0.62655037 -0.49772068 -0.00605401
C  1.32824194 0.68339058 -0.0027453
H  -3.33054601 1.59612561 -0.00803987
H  1.15664939 2.83472426 0.00740819
H  -1.29452533 2.88840736 -0.00095746
C  -1.54976744 -1.68987214 -0.01282619
H  1.1552781 -1.44083535 -0.01014131
C  -2.92911949 -1.64640583 -0.01569515
C  -3.56427562 -0.41297866 -0.01342069
H  -1.03813804 -2.64317634 -0.01396989
H  -3.52379369 -2.54640718 -0.01923007
H  -4.63782054 -0.30065094 -0.01486406
N  -2.84362779 0.70869967 -0.00934775
C  2.83899419 0.72192258 -0.03124161
H  3.15459276 0.93603004 -1.05692869
C  3.50691682 -0.52901304 0.4547819
H  3.35962755 -0.7698923 1.50311529
C  4.25395843 -1.3215321 -0.30093564
H  4.73121738 -2.20312449 0.10378021
H  4.42988223 -1.10770665 -1.34829206
H  3.16819437 1.57521919 0.56869913
